BDBM50523944 CHEMBL4544405
SMILES [#6]-n1c(-[#7]\[#7]=[#6]-2/[#6](=O)-[#7]-[#6](=O)-[#7]-[#6]-2=O)nc2n(-[#6])c(=O)n(-[#6])c(=O)c12
InChI Key InChIKey=BETBIKCJYWBSKI-UHFFFAOYSA-N
Data  1 Kd
  Tab Delimited (TSV)   2D SDfile   Computed 3D by Vconf -m prep SDfile
Find this compound or compounds like it in BindingDB:
Activity Spreadsheet -- Enzyme Inhibition Constant Data from BindingDB
Found 1 hit for monomerid = 50523944
TargetReplicase polyprotein 1ab(Middle East respiratory syndrome-related coronavir...)
University Of Illinois At Chicago
Curated by ChEMBL
LigandPNGBDBM50523944(CHEMBL4544405)
Affinity DataKd:  7.60E+3nM. Assay description: Binding affinity to MERS-CoV papain-like protease by SPR analysis
In DepthDetails ArticlePubMed