BDBM50524862 CHEMBL4475680
SMILES O[C@@]1(CCN(C1=O)c1ccc2NC(=O)CCc2c1)C(=O)NCc1cc(F)cc(Cl)c1
InChI Key InChIKey=RMWSKRBLJAUOOY-NRFANRHFSA-N
Data  2 KI  8 IC50
PDB links: 1 PDB ID matches this monomer.
  Tab Delimited (TSV)   2D SDfile   Computed 3D by Vconf -m prep SDfile
Find this compound or compounds like it in BindingDB:
Activity Spreadsheet -- Enzyme Inhibition Constant Data from BindingDB
Found 10 hits for monomerid = 50524862
TargetMethionine aminopeptidase 2(Homo sapiens (Human))
Merck Healthcare
Curated by ChEMBL
LigandPNGBDBM50524862(CHEMBL4475680)
Affinity DataKi:  0.160nM. Assay description: Inhibition of 5-[(S)-3-(3-Chloro-5-fluoro-benzylcarbamoyl)-3-hydroxy-2-oxopyrrolidin-1-yl]-1H-indole-2-carboxylic Acid (3-Amino-propyl)-amide-Dy647 b...
Ligand InfoPC cidPC sidPDB
TargetMethionine aminopeptidase 2(Homo sapiens (Human))
Merck Healthcare
Curated by ChEMBL
LigandPNGBDBM50524862(CHEMBL4475680)
Affinity DataKi:  0.160nM. Assay description: Inhibition of 5-[(S)-3-(3-Chloro-5-fluoro-benzylcarbamoyl)-3-hydroxy-2-oxopyrrolidin-1-yl]-1H-indole-2-carboxylic Acid (3-Amino-propyl)-amide-Dy647 b...
Ligand InfoPC cidPC sidPDB
TargetMethionine aminopeptidase 2(Homo sapiens (Human))
Merck Healthcare
Curated by ChEMBL
LigandPNGBDBM50524862(CHEMBL4475680)
Affinity DataIC50:  75nM. Assay description: Inhibition of recombinant human N-terminal His-tagged MetAP2 (2 to 478 residues) using Met-Ala-Ser as substrate and MnCl2 as co-facor preincubated fo...
Ligand InfoPC cidPC sidPDB
TargetMethionine aminopeptidase 2(Homo sapiens (Human))
Merck Healthcare
Curated by ChEMBL
LigandPNGBDBM50524862(CHEMBL4475680)
Affinity DataIC50:  15nM. Assay description: Inhibition of MetAP2 in HUVEC assessed as reduction in viability incubated for 3 days by CyQUANT Direct Cell proliferation assay
Ligand InfoPC cidPC sidPDB
TargetMethionine aminopeptidase 1(Homo sapiens (Human))
Merck Healthcare
Curated by ChEMBL
LigandPNGBDBM50524862(CHEMBL4475680)
Affinity DataIC50: >1.00E+4nM. Assay description: Inhibition of N-terminal MetAP1 (unknown origin)
Ligand InfoPC cidPC sidPDB
In DepthDetails ArticlePubMed
TargetMethionine aminopeptidase 2(Homo sapiens (Human))
Merck Healthcare
Curated by ChEMBL
LigandPNGBDBM50524862(CHEMBL4475680)
Affinity DataIC50:  75nM. Assay description: Inhibition of recombinant human N-terminal His-tagged MetAP2 (2 to 478 residues) using Met-Ala-Ser as substrate and MnCl2 as co-facor preincubated fo...
Ligand InfoPC cidPC sidPDB
TargetMethionine aminopeptidase 2(Homo sapiens (Human))
Merck Healthcare
Curated by ChEMBL
LigandPNGBDBM50524862(CHEMBL4475680)
Affinity DataIC50:  15nM. Assay description: Inhibition of MetAP2 in HUVEC assessed as reduction in viability incubated for 3 days by CyQUANT Direct Cell proliferation assay
Ligand InfoPC cidPC sidPDB
TargetMethionine aminopeptidase 1(Homo sapiens (Human))
Merck Healthcare
Curated by ChEMBL
LigandPNGBDBM50524862(CHEMBL4475680)
Affinity DataIC50: >1.00E+4nM. Assay description: Inhibition of N-terminal MetAP1 (unknown origin)
Ligand InfoPC cidPC sidPDB
In DepthDetails ArticlePubMed
TargetMethionine aminopeptidase 2(Homo sapiens (Human))
Merck Healthcare
Curated by ChEMBL
LigandPNGBDBM50524862(CHEMBL4475680)
Affinity DataIC50:  160nM. Assay description: Inhibition of recombinant human N-terminal His-tagged MetAP2 (2 to 478 residues) using Met-Ala-Ser as substrate and cobalt as co-facor preincubated f...
Ligand InfoPC cidPC sidPDB
TargetMethionine aminopeptidase 2(Homo sapiens (Human))
Merck Healthcare
Curated by ChEMBL
LigandPNGBDBM50524862(CHEMBL4475680)
Affinity DataIC50:  74nM. Assay description: Inhibition of recombinant human N-terminal His-tagged MetAP2 (2 to 478 residues) using Met-Ala-Ser as substrate and manganese as co-facor preincubate...
Ligand InfoPC cidPC sidPDB