BDBM50524986 CHEMBL4516124
SMILES C[C@H](Nc1ccc2c(cn(-c3cc(C)[nH]n3)c2n1)S(=O)(=O)C1COC1)c1ccc(F)cn1
InChI Key InChIKey=NNWRFTLSEJKLQI-ZDUSSCGKSA-N
Data  3 IC50
PDB links: 1 PDB ID matches this monomer.
  Tab Delimited (TSV)   2D SDfile   Computed 3D by Vconf -m prep SDfile
Find this compound or compounds like it in BindingDB:
Activity Spreadsheet -- Enzyme Inhibition Constant Data from BindingDB
Found 3 hits for monomerid = 50524986
TargetHigh affinity nerve growth factor receptor(Homo sapiens (Human))
Takeda Pharmaceutical
Curated by ChEMBL
LigandPNGBDBM50524986(CHEMBL4516124)
Affinity DataIC50:  730nM. Assay description: Inhibition of N-terminal GST-tagged human TrkA kinase domain (436 to 790 residues) expressed in baculovirus expression system using biotin-poly-GT as...
Ligand InfoPC cidPC sidPDB
In DepthDetails ArticlePubMed
TargetALK tyrosine kinase receptor(Homo sapiens (Human))
Takeda Pharmaceutical
Curated by ChEMBL
LigandPNGBDBM50524986(CHEMBL4516124)
Affinity DataIC50:  60nM. Assay description: Inhibition of recombinant human ALK expressed in HEK293 cells assessed as reduction in ALK autophosphorylation at Tyr1604 residue incubated for 60 mi...
Ligand InfoPC cidPC sidPDB
TargetALK tyrosine kinase receptor(Homo sapiens (Human))
Takeda Pharmaceutical
Curated by ChEMBL
LigandPNGBDBM50524986(CHEMBL4516124)
Affinity DataIC50:  20nM. Assay description: Inhibition of human ALK kinase domain (1058 to 1620 residues) expressed in baculovirus expression system using biotin-poly-GT as substrate pre-incuba...
Ligand InfoPC cidPC sidPDB