BDBM50525016 CHEMBL4457217
SMILES [H][C@]12COC(=O)N1[C@H](NCCCCCCCCCN=[N+]=[N-])[C@@H](O)[C@@H](O)[C@@H]2O
InChI Key InChIKey=RAROPZJHQPENPG-MRLBHPIUSA-N
Data  1 KI  1 IC50
  Tab Delimited (TSV)   2D SDfile   Computed 3D by Vconf -m prep SDfile
Find this compound or compounds like it in BindingDB:
Activity Spreadsheet -- Enzyme Inhibition Constant Data from BindingDB
Found 2 hits for monomerid = 50525016
TargetAlpha-mannosidase(Canavalia ensiformis)
University Of Sevilla
Curated by ChEMBL
LigandPNGBDBM50525016(CHEMBL4457217)
Affinity DataKi:  500nM. Assay description: Inhibition of jack bean Lysosomal alpha-mannosidase assessed as residual hydrolytic activity after 10 to 30 mins by spectrophotometric analysis
Ligand InfoPC cidPC sid
In DepthDetails ArticlePubMed
TargetLysosomal alpha-mannosidase(Homo sapiens (Human))
University Of Sevilla
Curated by ChEMBL
LigandPNGBDBM50525016(CHEMBL4457217)
Affinity DataIC50:  1.93E+4nM. Assay description: Inhibition of Lysosomal alpha-mannosidase in wild-type human fibroblast cell lysates using 4-methylumbelliferone alpha-D-mannopyranoside as a reporte...
Ligand InfoPC cidPC sid
In DepthDetails ArticlePubMed