BDBM50526607 CHEMBL4474801
SMILES CNc1cc(Nc2cccn(-c3ccc(F)nc3)c2=O)nn2c(cnc12)C(=O)NC1CC1
InChI Key InChIKey=HZFXQHPLBDWPPX-UHFFFAOYSA-N
Data  3 KI
  Tab Delimited (TSV)   2D SDfile   Computed 3D by Vconf -m prep SDfile
Find this compound or compounds like it in BindingDB:
Activity Spreadsheet -- Enzyme Inhibition Constant Data from BindingDB
Found 3 hits for monomerid = 50526607
TargetNon-receptor tyrosine-protein kinase TYK2(Homo sapiens (Human))
Bristol-Myers Squibb
Curated by ChEMBL
LigandPNGBDBM50526607(CHEMBL4474801)
Affinity DataKi:  0.140nM. Assay description: Inhibition of fluorescein-labeled kinase tracer binding to His-TVMV-fused TYK2 JH2 domain (575 to 869 residues) (unknown origin) measured after 90 mi...
Ligand InfoPC cidPC sid
In DepthDetails ArticlePubMed
TargetNon-receptor tyrosine-protein kinase TYK2(Homo sapiens (Human))
Bristol-Myers Squibb
Curated by ChEMBL
LigandPNGBDBM50526607(CHEMBL4474801)
Affinity DataKi:  140nM. Assay description: Inhibition of TYK2 JH2 domain in IFNalpha/IL23-stimulated human Kit225 cells by luciferase reporter assay
Ligand InfoPC cidPC sid
In DepthDetails ArticlePubMed
TargetNon-receptor tyrosine-protein kinase TYK2(Homo sapiens (Human))
Bristol-Myers Squibb
Curated by ChEMBL
LigandPNGBDBM50526607(CHEMBL4474801)
Affinity DataKi:  380nM. Assay description: Inhibition of TYK2 JH2 domain in human whole blood assessed as decrease in IFNalpha/IL2-induced STAT phosphorylation preincubated for 1 hr followed b...
Ligand InfoPC cidPC sid
In DepthDetails ArticlePubMed