BDBM50526619 CHEMBL4439957
SMILES CNc1cc(Nc2cccn(-c3ccc(F)cn3)c2=O)nn2c(cnc12)C(=O)N[C@@H]1C[C@@H]1F
InChI Key InChIKey=NDLADMBXOKVXLV-GXTWGEPZSA-N
Data  3 KI
  Tab Delimited (TSV)   2D SDfile   Computed 3D by Vconf -m prep SDfile
Find this compound or compounds like it in BindingDB:
Activity Spreadsheet -- Enzyme Inhibition Constant Data from BindingDB
Found 3 hits for monomerid = 50526619
TargetNon-receptor tyrosine-protein kinase TYK2(Homo sapiens (Human))
Bristol-Myers Squibb
Curated by ChEMBL
LigandPNGBDBM50526619(CHEMBL4439957)
Affinity DataKi:  0.0350nM. Assay description: Inhibition of fluorescein-labeled kinase tracer binding to His-TVMV-fused TYK2 JH2 domain (575 to 869 residues) (unknown origin) measured after 90 mi...
Ligand InfoPC cidPC sid
In DepthDetails ArticlePubMed
TargetNon-receptor tyrosine-protein kinase TYK2(Homo sapiens (Human))
Bristol-Myers Squibb
Curated by ChEMBL
LigandPNGBDBM50526619(CHEMBL4439957)
Affinity DataKi:  26nM. Assay description: Inhibition of TYK2 JH2 domain in IFNalpha/IL23-stimulated human Kit225 cells by luciferase reporter assay
Ligand InfoPC cidPC sid
In DepthDetails ArticlePubMed
TargetNon-receptor tyrosine-protein kinase TYK2(Homo sapiens (Human))
Bristol-Myers Squibb
Curated by ChEMBL
LigandPNGBDBM50526619(CHEMBL4439957)
Affinity DataKi:  85nM. Assay description: Inhibition of TYK2 JH2 domain in human whole blood assessed as decrease in IFNalpha/IL2-induced STAT phosphorylation preincubated for 1 hr followed b...
Ligand InfoPC cidPC sid
In DepthDetails ArticlePubMed