BDBM50526620 CHEMBL4460368
SMILES CNc1cc(Nc2cccn(-c3cc(C)n(C)n3)c2=O)nn2c(cnc12)C(=O)N[C@@H]1C[C@@H]1F
InChI Key InChIKey=HQUSOQAEDDQGLX-GXTWGEPZSA-N
Data  3 KI
  Tab Delimited (TSV)   2D SDfile   Computed 3D by Vconf -m prep SDfile
Find this compound or compounds like it in BindingDB:
Activity Spreadsheet -- Enzyme Inhibition Constant Data from BindingDB
Found 3 hits for monomerid = 50526620
TargetNon-receptor tyrosine-protein kinase TYK2(Homo sapiens (Human))
Bristol-Myers Squibb
Curated by ChEMBL
LigandPNGBDBM50526620(CHEMBL4460368)
Affinity DataKi:  0.0150nM. Assay description: Inhibition of fluorescein-labeled kinase tracer binding to His-TVMV-fused TYK2 JH2 domain (575 to 869 residues) (unknown origin) measured after 90 mi...
Ligand InfoPC cidPC sid
In DepthDetails ArticlePubMed
TargetNon-receptor tyrosine-protein kinase TYK2(Homo sapiens (Human))
Bristol-Myers Squibb
Curated by ChEMBL
LigandPNGBDBM50526620(CHEMBL4460368)
Affinity DataKi:  22nM. Assay description: Inhibition of TYK2 JH2 domain in IFNalpha/IL23-stimulated human Kit225 cells by luciferase reporter assay
Ligand InfoPC cidPC sid
In DepthDetails ArticlePubMed
TargetNon-receptor tyrosine-protein kinase TYK2(Homo sapiens (Human))
Bristol-Myers Squibb
Curated by ChEMBL
LigandPNGBDBM50526620(CHEMBL4460368)
Affinity DataKi:  90nM. Assay description: Inhibition of TYK2 JH2 domain in human whole blood assessed as decrease in IFNalpha/IL2-induced STAT phosphorylation preincubated for 1 hr followed b...
Ligand InfoPC cidPC sid
In DepthDetails ArticlePubMed