BDBM50526998 CHEMBL4449403
SMILES CCCCCCC[S+]([O-])CC(=O)NC1CCOC1=O
InChI Key InChIKey=ICEWDCUQBVEEIK-UHFFFAOYSA-N
Data  1 IC50
  Tab Delimited (TSV)   2D SDfile   Computed 3D by Vconf -m prep SDfile
Find this compound or compounds like it in BindingDB:
Activity Spreadsheet -- Enzyme Inhibition Constant Data from BindingDB
Found 1 hit for monomerid = 50526998
TargetTranscriptional activator protein LasR(Pseudomonas aeruginosa)
Larkin University
Curated by ChEMBL
LigandPNGBDBM50526998(CHEMBL4449403)
Affinity DataIC50:  5.00E+4nM. Assay description: Antagonist activity at Pseudomonas aeruginosa LasR transfected with lasB-GFP by luminescence method
Ligand InfoPC cidPC sid
In DepthDetails ArticlePubMed