BDBM50528943 CHEMBL4562561
SMILES Nc1nc2[nH]cc(Cc3ccc(cc3)C(=O)Nc3cc(ccc3C(O)=O)C(O)=O)c2c(=O)[nH]1
InChI Key InChIKey=UKZJDHHDTGYQBX-UHFFFAOYSA-N
Data  2 IC50
PDB links: 2 PDB IDs match this monomer.
  Tab Delimited (TSV)   2D SDfile   Computed 3D by Vconf -m prep SDfile
Find this compound or compounds like it in BindingDB:
Activity Spreadsheet -- Enzyme Inhibition Constant Data from BindingDB
Found 2 hits for monomerid = 50528943
TargetPolyunsaturated fatty acid lipoxygenase ALOX15B(Rattus norvegicus)
Yale University
Curated by ChEMBL
LigandPNGBDBM50528943(CHEMBL4562561)
Affinity DataIC50:  260nM. Assay description: Inhibition of recombinant human His6-tagged TS using dUMP and 5,10-methylenetetrahydrofolate as substrate by spectrometry
Ligand InfoPC cidPC sidPDB
In DepthDetails ArticlePubMed
TargetBifunctional dihydrofolate reductase-thymidylate synthase(Cryptosporidium hominis)
Yale University
Curated by ChEMBL
LigandPNGBDBM50528943(CHEMBL4562561)
Affinity DataIC50:  1.80E+4nM. Assay description: Inhibition of recombinant Cryptosporidium hominis TS-DHFR expresssed in Escherichia coli PA414 using dUMP and 5,10-methylenetetrahydrofolate as subst...
Ligand InfoPC cidPC sidPDB