BDBM50530229 CHEMBL4460840
SMILES CC(C)C[C@H](NC(C)=O)C(=O)N[C@@H](Cc1ccccc1)P(O)(=O)C[C@@H](Cc1ccccc1)C(O)=O
InChI Key InChIKey=GRMCSCYPDCPNRA-TZRRMPRUSA-N
Data  8 KI
  Tab Delimited (TSV)   2D SDfile   Computed 3D by Vconf -m prep SDfile
Find this compound or compounds like it in BindingDB:
Activity Spreadsheet -- Enzyme Inhibition Constant Data from BindingDB
Found 8 hits for monomerid = 50530229
TargetCarboxypeptidase A1(Homo sapiens (Human))
Universitat Aut£Noma De Barcelona
Curated by ChEMBL
LigandPNGBDBM50530229(CHEMBL4460840)
Affinity DataKi:  0.0400nM. Assay description: Inhibition of human CPA1 using AAFP as substrate preincubated for 45 mins to 2 hrs measured at 30 sec intervals for 15 mins by UV/vis-spectrophotomet...
Ligand InfoPC cidPC sid
In DepthDetails ArticlePubMed
TargetCarboxypeptidase A1(Homo sapiens (Human))
Universitat Aut£Noma De Barcelona
Curated by ChEMBL
LigandPNGBDBM50530229(CHEMBL4460840)
Affinity DataKi:  0.0400nM. Assay description: Inhibition of human CPA1 using AAFP as substrate preincubated for 45 mins to 2 hrs measured at 30 sec intervals for 15 mins by UV/vis-spectrophotomet...
Ligand InfoPC cidPC sid
In DepthDetails ArticlePubMed
TargetCarboxypeptidase B(Homo sapiens (Human))
Universitat Aut£Noma De Barcelona
Curated by ChEMBL
LigandPNGBDBM50530229(CHEMBL4460840)
Affinity DataKi:  0.120nM. Assay description: Inhibition of human CPB1 using AAFA as substrate preincubated for 45 mins to 2 hrs measured at 30 sec intervals for 15 mins by UV/vis-spectrophotomet...
Ligand InfoPC cidPC sid
In DepthDetails ArticlePubMed
TargetCarboxypeptidase B(Homo sapiens (Human))
Universitat Aut£Noma De Barcelona
Curated by ChEMBL
LigandPNGBDBM50530229(CHEMBL4460840)
Affinity DataKi:  0.120nM. Assay description: Inhibition of human CPB1 using AAFA as substrate preincubated for 45 mins to 2 hrs measured at 30 sec intervals for 15 mins by UV/vis-spectrophotomet...
Ligand InfoPC cidPC sid
In DepthDetails ArticlePubMed
TargetCarboxypeptidase A4(Homo sapiens)
Universitat Aut£Noma De Barcelona
Curated by ChEMBL
LigandPNGBDBM50530229(CHEMBL4460840)
Affinity DataKi:  0.390nM. Assay description: Inhibition of human CPA4 using AAFP as substrate preincubated for 45 mins to 2 hrs measured at 30 sec intervals for 15 mins by UV/vis-spectrophotomet...
Ligand InfoPC cidPC sid
In DepthDetails ArticlePubMed
TargetCarboxypeptidase A4(Homo sapiens)
Universitat Aut£Noma De Barcelona
Curated by ChEMBL
LigandPNGBDBM50530229(CHEMBL4460840)
Affinity DataKi:  0.390nM. Assay description: Inhibition of human CPA4 using AAFP as substrate preincubated for 45 mins to 2 hrs measured at 30 sec intervals for 15 mins by UV/vis-spectrophotomet...
Ligand InfoPC cidPC sid
In DepthDetails ArticlePubMed
TargetCarboxypeptidase A2(Homo sapiens)
Universitat Aut£Noma De Barcelona
Curated by ChEMBL
LigandPNGBDBM50530229(CHEMBL4460840)
Affinity DataKi:  1nM. Assay description: Inhibition of human CPA2 using AAFP as substrate preincubated for 45 mins to 2 hrs measured at 30 sec intervals for 15 mins by UV/vis-spectrophotomet...
Ligand InfoPC cidPC sid
In DepthDetails ArticlePubMed
TargetCarboxypeptidase A2(Homo sapiens)
Universitat Aut£Noma De Barcelona
Curated by ChEMBL
LigandPNGBDBM50530229(CHEMBL4460840)
Affinity DataKi:  1nM. Assay description: Inhibition of human CPA2 using AAFP as substrate preincubated for 45 mins to 2 hrs measured at 30 sec intervals for 15 mins by UV/vis-spectrophotomet...
Ligand InfoPC cidPC sid
In DepthDetails ArticlePubMed