BDBM50530710 IODOPHTHALEIN
SMILES Oc1c(I)cc(cc1I)C1(OC(=O)c2ccccc12)c1cc(I)c(O)c(I)c1
InChI Key InChIKey=FWQKRBDABCRWKV-UHFFFAOYSA-N
Data  2 IC50
  Tab Delimited (TSV)   2D SDfile   Computed 3D by Vconf -m prep SDfile
Find this compound or compounds like it in BindingDB:
Activity Spreadsheet -- Enzyme Inhibition Constant Data from BindingDB
Found 2 hits for monomerid = 50530710
TargetBeta-lactamase TEM(Escherichia coli)
University Of California
Curated by ChEMBL
LigandPNGBDBM50530710(IODOPHTHALEIN)
Affinity DataIC50:  3.40E+3nM. Assay description: Inhibition of bacterial wild type Beta-lactamase TEM-1 pre-incubated for 5 mins before addition of chromogenic beta-lactamase substrate CENTA by spec...
In DepthDetails ArticlePubMed
TargetBeta-lactamase TEM(Escherichia coli)
University Of California
Curated by ChEMBL
LigandPNGBDBM50530710(IODOPHTHALEIN)
Affinity DataIC50:  3.40E+3nM. Assay description: Inhibition of bacterial wild type Beta-lactamase TEM-1 pre-incubated for 5 mins before addition of chromogenic beta-lactamase substrate CENTA by spec...
In DepthDetails ArticlePubMed