BDBM50531540 CHEBI:75998::GSK-1120212::GSK1120212::JTP 74057::JTP-74057::Mekinist::TMT-212::Tmt212::Trametinib::US11147816, Trametinib::US11701360, Trametinib
SMILES CC(=O)Nc1cccc(c1)-n1c2c(C)c(=O)n(C)c(Nc3ccc(I)cc3F)c2c(=O)n(C2CC2)c1=O
InChI Key InChIKey=LIRYPHYGHXZJBZ-UHFFFAOYSA-N
Data  10 IC50  1 EC50
PDB links: 3 PDB IDs match this monomer.
  Tab Delimited (TSV)   2D SDfile   Computed 3D by Vconf -m prep SDfile
Find this compound or compounds like it in BindingDB:
Activity Spreadsheet -- Enzyme Inhibition Constant Data from BindingDB
Found 11 hits for monomerid = 50531540
TargetATP-dependent translocase ABCB1(Homo sapiens (Human))
Rheinische Friedrich-Wilhelms-University Of Bonn
Curated by ChEMBL
LigandPNGBDBM50531540(CHEBI:75998 | GSK-1120212 | GSK1120212 | JTP 74057...)
Affinity DataEC50:  247nM. Assay description: Inhibition of ABCB1 in human A2780/ADR cells assessed as potentiation of daunorubicin-induced cytotoxicity measured after 72 hrs by MTT assay
In DepthDetails ArticlePubMed
TargetDual specificity mitogen-activated protein kinase kinase 1(Homo sapiens (Human))
Mansoura University
Curated by ChEMBL
LigandPNGBDBM50531540(CHEBI:75998 | GSK-1120212 | GSK1120212 | JTP 74057...)
Affinity DataIC50:  0.700nM. Assay description: Inhibition of MEK1 (unknown origin)
TargetDual specificity mitogen-activated protein kinase kinase 2(Homo sapiens (Human))
Mansoura University
Curated by ChEMBL
LigandPNGBDBM50531540(CHEBI:75998 | GSK-1120212 | GSK1120212 | JTP 74057...)
Affinity DataIC50:  15nM. Assay description: Inhibition of MEK2 (unknown origin)
TargetDual specificity mitogen-activated protein kinase kinase 1(Homo sapiens (Human))
Mansoura University
Curated by ChEMBL
LigandPNGBDBM50531540(CHEBI:75998 | GSK-1120212 | GSK1120212 | JTP 74057...)
Affinity DataIC50:  2.16nM. Assay description: The IC50 for MEK1 and 2 can be measured by methods in references such as [Yamaguchi et al. (2011) International Journal of Oncology 39:23-31].
LigandPNGBDBM50531540(CHEBI:75998 | GSK-1120212 | GSK1120212 | JTP 74057...)
Affinity DataIC50: <1nM. Assay description: Inhibition of MEK in human KYSE-520 cells assessed as reduction in p-ERK levels
LigandPNGBDBM50531540(CHEBI:75998 | GSK-1120212 | GSK1120212 | JTP 74057...)
Affinity DataIC50:  2nM. Assay description: Inhibition of MEK 1/2 (unknown origin)
TargetDual specificity mitogen-activated protein kinase kinase 1(Homo sapiens (Human))
Mansoura University
Curated by ChEMBL
LigandPNGBDBM50531540(CHEBI:75998 | GSK-1120212 | GSK1120212 | JTP 74057...)
Affinity DataIC50:  0.920nM. Assay description: Non competitive inhibition of MEK1 (unknown origin)
TargetDual specificity mitogen-activated protein kinase kinase 2(Homo sapiens (Human))
Mansoura University
Curated by ChEMBL
LigandPNGBDBM50531540(CHEBI:75998 | GSK-1120212 | GSK1120212 | JTP 74057...)
Affinity DataIC50:  1.80nM. Assay description: Non competitive inhibition of MEK2 (unknown origin)
TargetDual specificity mitogen-activated protein kinase kinase 1(Homo sapiens (Human))
Mansoura University
Curated by ChEMBL
LigandPNGBDBM50531540(CHEBI:75998 | GSK-1120212 | GSK1120212 | JTP 74057...)
Affinity DataIC50:  0.920nM. Assay description: Inhibition of MEK1 (unknown origin)
TargetDual specificity mitogen-activated protein kinase kinase 2(Homo sapiens (Human))
Mansoura University
Curated by ChEMBL
LigandPNGBDBM50531540(CHEBI:75998 | GSK-1120212 | GSK1120212 | JTP 74057...)
Affinity DataIC50:  1.80nM. Assay description: Inhibition of MEK2 (unknown origin)
LigandPNGBDBM50531540(CHEBI:75998 | GSK-1120212 | GSK1120212 | JTP 74057...)
Affinity DataIC50:  2.16nM. Assay description: TBD