BDBM50531563 CHEMBL4463240
SMILES CC(C)Cc1cc2N([C@@H](CS(N)(=O)=O)COc2cc1F)C(=O)c1ccc2OCC(=O)Nc2c1
InChI Key InChIKey=NREZDYQUMMSPNC-OAHLLOKOSA-N
Data  2 KI  1 IC50
  Tab Delimited (TSV)   2D SDfile   Computed 3D by Vconf -m prep SDfile
Find this compound or compounds like it in BindingDB:
Activity Spreadsheet -- Enzyme Inhibition Constant Data from BindingDB
Found 3 hits for monomerid = 50531563
TargetMineralocorticoid receptor(Homo sapiens (Human))
Pharmaron-Beijing
Curated by ChEMBL
LigandPNGBDBM50531563(CHEMBL4463240)
Affinity DataKi: >0.316nM. Assay description: Displacement of [3H]-aldosterone to human mineralocorticoid receptor LBD by radiometric binding assay
Ligand InfoPC cidPC sid
In DepthDetails ArticlePubMed
TargetGlucocorticoid receptor(Homo sapiens (Human))
Pharmaron-Beijing
Curated by ChEMBL
LigandPNGBDBM50531563(CHEMBL4463240)
Affinity DataKi:  1.60nM. Assay description: Binding affinity to recombinant human GR LBD by fluormone GS red-fluorescence polarization assay
Ligand InfoPC cidPC sid
In DepthDetails ArticlePubMed
TargetMineralocorticoid receptor(Homo sapiens (Human))
Pharmaron-Beijing
Curated by ChEMBL
LigandPNGBDBM50531563(CHEMBL4463240)
Affinity DataIC50:  0.794nM. Assay description: Antagonist activity at gal4-fused human mineralocorticoid receptor LBD expressed in UAS-MR-bla HEK293 cells by luciferase reporter gene assay
Ligand InfoPC cidPC sid
In DepthDetails ArticlePubMed