BDBM50531570 CHEMBL4556735
SMILES Cc1ccc2N(C(=O)c3ccc4OCC(=O)Nc4c3)[C@@](C)(CS(C)(=O)=O)COc2c1
InChI Key InChIKey=AXOMYVRKJFDZJX-OAQYLSRUSA-N
Data  2 KI  1 IC50
  Tab Delimited (TSV)   2D SDfile   Computed 3D by Vconf -m prep SDfile
Find this compound or compounds like it in BindingDB:
Activity Spreadsheet -- Enzyme Inhibition Constant Data from BindingDB
Found 3 hits for monomerid = 50531570
TargetMineralocorticoid receptor(Homo sapiens (Human))
Pharmaron-Beijing
Curated by ChEMBL
LigandPNGBDBM50531570(CHEMBL4556735)
Affinity DataKi:  16nM. Assay description: Displacement of [3H]-aldosterone to human mineralocorticoid receptor LBD by radiometric binding assay
Ligand InfoPC cidPC sid
In DepthDetails ArticlePubMed
TargetGlucocorticoid receptor(Homo sapiens (Human))
Pharmaron-Beijing
Curated by ChEMBL
LigandPNGBDBM50531570(CHEMBL4556735)
Affinity DataKi:  1.00E+3nM. Assay description: Binding affinity to recombinant human GR LBD by fluormone GS red-fluorescence polarization assay
Ligand InfoPC cidPC sid
In DepthDetails ArticlePubMed
TargetMineralocorticoid receptor(Homo sapiens (Human))
Pharmaron-Beijing
Curated by ChEMBL
LigandPNGBDBM50531570(CHEMBL4556735)
Affinity DataIC50:  63nM. Assay description: Antagonist activity at gal4-fused human mineralocorticoid receptor LBD expressed in UAS-MR-bla HEK293 cells by luciferase reporter gene assay
Ligand InfoPC cidPC sid
In DepthDetails ArticlePubMed