BDBM50533717 CHEMBL4449284
SMILES [H][C@@]12C[C@@H]([C@H](CC)CN1CC[C@]21Nc2cccc(C#N)c2C1=O)C(=C/OC)\C(=O)OC
InChI Key InChIKey=ZJBWZCZZHDSXLW-DXHWDBQJSA-N
Data  3 KI  2 IC50  1 EC50
  Tab Delimited (TSV)   2D SDfile   Computed 3D by Vconf -m prep SDfile
Find this compound or compounds like it in BindingDB:
Activity Spreadsheet -- Enzyme Inhibition Constant Data from BindingDB
Found 6 hits for monomerid = 50533717
TargetMu-type opioid receptor(MOUSE)
Memorial Sloan Kettering Cancer Center
Curated by ChEMBL
LigandPNGBDBM50533717(CHEMBL4449284)
Affinity DataKi:  0.5nM. Assay description: Displacement of [125I]-IBNtxA from mouse mu opioid receptor-1 expressed in CHO cell membranes incubated for 90 mins
Ligand InfoPC cidPC sid
In DepthDetails ArticlePubMed
TargetDelta-type opioid receptor(MOUSE)
Memorial Sloan Kettering Cancer Center
Curated by ChEMBL
LigandPNGBDBM50533717(CHEMBL4449284)
Affinity DataKi:  2.40nM. Assay description: Displacement of [125I]-IBNtxA from mouse delta opioid receptor-1 expressed in CHO cell membranes incubated for 90 mins
Ligand InfoPC cidPC sid
In DepthDetails ArticlePubMed
TargetKappa-type opioid receptor(Mus musculus (Mouse))
Memorial Sloan Kettering Cancer Center
Curated by ChEMBL
LigandPNGBDBM50533717(CHEMBL4449284)
Affinity DataKi:  47nM. Assay description: Displacement of [125I]-IBNtxA from mouse kappa opioid receptor-1 expressed in CHO cell membranes incubated for 90 mins
Ligand InfoPC cidPC sid
In DepthDetails ArticlePubMed
TargetKappa-type opioid receptor(Mus musculus (Mouse))
Memorial Sloan Kettering Cancer Center
Curated by ChEMBL
LigandPNGBDBM50533717(CHEMBL4449284)
Affinity DataIC50:  721nM. Assay description: Antagonist activity at mouse kappa opioid receptor-1 expressed in CHO cell membranes assessed as inhibition of U50,488H-induced [35S]GTPgammaS bindin...
Ligand InfoPC cidPC sid
In DepthDetails ArticlePubMed
TargetDelta-type opioid receptor(MOUSE)
Memorial Sloan Kettering Cancer Center
Curated by ChEMBL
LigandPNGBDBM50533717(CHEMBL4449284)
Affinity DataIC50:  73nM. Assay description: Antagonist activity at mouse delta opioid receptor-1 expressed in CHO cell membranes assessed as inhibition of DPDPE-induced [35S]GTPgammaS binding i...
Ligand InfoPC cidPC sid
In DepthDetails ArticlePubMed
TargetMu-type opioid receptor(MOUSE)
Memorial Sloan Kettering Cancer Center
Curated by ChEMBL
LigandPNGBDBM50533717(CHEMBL4449284)
Affinity DataEC50:  0.700nM. Assay description: Agonist activity at mouse mu opioid receptor-1 expressed in CHO cell membranes assessed as [35S]GTPgammaS binding incubated for 60 mins by scintillat...
Ligand InfoPC cidPC sid
In DepthDetails ArticlePubMed