BDBM561986 BDBM50537611::US11396496, Compound A4
SMILES OC(=O)CN(c1cnc(N(CC(O)=O)S(=O)(=O)c2ccc(O)cc2)c2ccccc12)S(=O)(=O)c1ccc(O)cc1
InChI Key InChIKey=ZSEXZJWRCNQRNZ-UHFFFAOYSA-N
Data  2 IC50
  Tab Delimited (TSV)   2D SDfile   Computed 3D by Vconf -m prep SDfile
Find this compound or compounds like it in BindingDB:
Activity Spreadsheet -- Enzyme Inhibition Constant Data from BindingDB
Found 2 hits for monomerid = 561986
TargetKelch-like ECH-associated protein 1/Nuclear factor erythroid 2-related factor 2(Homo sapiens (Human))
The Board Of Trustees Of The University Of Illinois
US Patent
LigandPNGBDBM561986(BDBM50537611 | US11396496, Compound A4)
Affinity DataIC50:  530nM. Assay description: The IC50 of the compounds for inhibiting the interaction of a fluorescent NRF2 peptide and the Kelch domain of KEAP1 was determined using fluorescenc...
Ligand InfoPC cidPC sid
In DepthDetails US Patent
TargetNuclear factor erythroid 2-related factor 2(Homo sapiens (Human))
TBA
Curated by ChEMBL
LigandPNGBDBM561986(BDBM50537611 | US11396496, Compound A4)
Affinity DataIC50:  350nM. Assay description: Concentration required to inhibit the phosphorylation of a 14-residue fragment of phospholipase C gamma 1 by Epidermal growth factor receptor from A4...
Ligand InfoPC cidPC sid
In DepthDetails ArticlePubMed