BDBM561992 BDBM50537618::US11396496, Compound B0
SMILES COc1ccc(cc1)S(=O)(=O)N(CC(O)=O)c1ncc(N(CC(F)(F)F)S(=O)(=O)c2ccc(OC)cc2)c2ccccc12
InChI Key InChIKey=UVJKKKIWFDQRIO-UHFFFAOYSA-N
Data  4 IC50
  Tab Delimited (TSV)   2D SDfile   Computed 3D by Vconf -m prep SDfile
Find this compound or compounds like it in BindingDB:
Activity Spreadsheet -- Enzyme Inhibition Constant Data from BindingDB
Found 4 hits for monomerid = 561992
TargetNuclear factor erythroid 2-related factor 2(Homo sapiens (Human))
TBA
Curated by ChEMBL
LigandPNGBDBM561992(BDBM50537618 | US11396496, Compound B0)
Affinity DataIC50:  73nM. Assay description: Inhibitory potency against isolated epidermal growth factor receptor (EGFR) from human A431 carcinoma cells
Ligand InfoPC cidPC sid
In DepthDetails ArticlePubMed
TargetKelch-like ECH-associated protein 1(Homo sapiens (Human))
University Of Copenhagen
Curated by ChEMBL
LigandPNGBDBM561992(BDBM50537618 | US11396496, Compound B0)
Affinity DataIC50:  73nM. Assay description: Inhibition of Keap1 kelch domain to Nrf2 (unknown origin) protein-protein interaction
Ligand InfoPC cidPC sid
In DepthDetails PubMed
TargetKelch-like ECH-associated protein 1/Nuclear factor erythroid 2-related factor 2(Homo sapiens (Human))
The Board Of Trustees Of The University Of Illinois
US Patent
LigandPNGBDBM561992(BDBM50537618 | US11396496, Compound B0)
Affinity DataIC50:  74nM. Assay description: The IC50 of the compounds for inhibiting the interaction of a fluorescent NRF2 peptide and the Kelch domain of KEAP1 was determined using fluorescenc...
Ligand InfoPC cidPC sid
In DepthDetails US Patent
TargetKelch-like ECH-associated protein 1(Homo sapiens (Human))
University Of Copenhagen
Curated by ChEMBL
LigandPNGBDBM561992(BDBM50537618 | US11396496, Compound B0)
Affinity DataIC50:  73nM. Assay description: Inhibition of FITC-9mer Nrf2 peptide interaction with human recombinant Keap1 Kelch domain (321 to 609 residues) expressed in Escherichia coli DE3 ce...
Ligand InfoPC cidPC sid
In DepthDetails ArticlePubMed