BDBM50539117 CHEMBL4648396
SMILES CN1c2ccc(NC(=O)Nc3ccc(cc3)C(F)(F)F)cc2C(C)(C)C(O)C1(C)C
InChI Key InChIKey=AYLCUMDOKMCRMV-UHFFFAOYSA-N
Data  1 Kd
  Tab Delimited (TSV)   2D SDfile   Computed 3D by Vconf -m prep SDfile
Find this compound or compounds like it in BindingDB:
Activity Spreadsheet -- Enzyme Inhibition Constant Data from BindingDB
Found 1 hit for monomerid = 50539117
TargetStress-70 protein, mitochondrial(Homo sapiens)
Oklahoma State University
Curated by ChEMBL
LigandPNGBDBM50539117(CHEMBL4648396)
Affinity DataKd:  700nM. Assay description: Binding affinity to mortalin substrate binding domain (unknown origin)
Ligand InfoPC cidPC sid
In DepthDetails ArticlePubMed