BDBM50539271 CHEMBL4643186
SMILES OB(O)c1ccc(COc2ccc(CNC(=O)[C@@H]3CCC(=O)N3Cc3ccccc3)cc2)cc1
InChI Key InChIKey=YVLZFMCOVOYTTQ-DEOSSOPVSA-N
Data  1 IC50
  Tab Delimited (TSV)   2D SDfile   Computed 3D by Vconf -m prep SDfile
Find this compound or compounds like it in BindingDB:
Activity Spreadsheet -- Enzyme Inhibition Constant Data from BindingDB
Found 1 hit for monomerid = 50539271
TargetAtaxin-2(Mus musculus)
National And Kapodistrian University Of Athens
Curated by ChEMBL
LigandPNGBDBM50539271(CHEMBL4643186)
Affinity DataIC50:  35nM. Assay description: Inhibition of recombinant mouse N-terminal polyHis-tagged ATX-beta (Ser49 to Ile862 residues) expressed in HEK293 cells assessed as reduction in clea...
Ligand InfoPC cidPC sid
In DepthDetails ArticlePubMed