BDBM50539356 CHEMBL4641404
SMILES OC(=O)c1ccc(O[C@H]2CC[C@@H](CC2)N2C(=O)N(C(=O)C2=O)C23CC4CC(CC(Cl)(C4)C2)C3)cc1
InChI Key InChIKey=LWSUPUCMKHRSAU-HKHZJBOTSA-N
Data  1 IC50
  Tab Delimited (TSV)   2D SDfile   Computed 3D by Vconf -m prep SDfile
Find this compound or compounds like it in BindingDB:
Activity Spreadsheet -- Enzyme Inhibition Constant Data from BindingDB
Found 1 hit for monomerid = 50539356
TargetBifunctional epoxide hydrolase 2(Homo sapiens (Human))
University Of California Davis
Curated by ChEMBL
LigandPNGBDBM50539356(CHEMBL4641404)
Affinity DataIC50:  0.400nM. Assay description: Inhibition of human soluble epoxide hydrolase by kinetic fluorescent assay
Ligand InfoPC cidPC sid
In DepthDetails ArticlePubMed