BDBM50539742 CHEMBL4642292
SMILES Cc1nccc2-c3ccc(Br)cc3NC(C)(C)c12
InChI Key InChIKey=YBGLIPYAJPOYAD-UHFFFAOYSA-N
Data  40 KI
  Tab Delimited (TSV)   2D SDfile   Computed 3D by Vconf -m prep SDfile
Find this compound or compounds like it in BindingDB:
Activity Spreadsheet -- Enzyme Inhibition Constant Data from BindingDB
Found 40 hits for monomerid = 50539742
Target5-hydroxytryptamine receptor 2B(Homo sapiens (Human))
University Of Mississippi
Curated by ChEMBL
LigandPNGBDBM50539742(CHEMBL4642292)
Affinity DataKi:  390nM. Assay description: Binding affinity to 5HT2B receptor (unknown origin)
Ligand InfoPC cidPC sid
In DepthDetails ArticlePubMed
TargetSigma non-opioid intracellular receptor 1(Homo sapiens (Human))
University Of Mississippi
Curated by ChEMBL
LigandPNGBDBM50539742(CHEMBL4642292)
Affinity DataKi:  560nM. Assay description: Binding affinity to sigma1 receptor (unknown origin)
Ligand InfoPC cidPC sid
In DepthDetails ArticlePubMed
TargetAlpha-1B adrenergic receptor(Homo sapiens (Human))
University Of Mississippi
Curated by ChEMBL
LigandPNGBDBM50539742(CHEMBL4642292)
Affinity DataKi: >1.00E+4nM. Assay description: Binding affinity to adrenoceptor alpha 1B (unknown origin)
Ligand InfoPC cidPC sid
In DepthDetails ArticlePubMed
TargetAlpha-1A adrenergic receptor(Homo sapiens (Human))
University Of Mississippi
Curated by ChEMBL
LigandPNGBDBM50539742(CHEMBL4642292)
Affinity DataKi: >1.00E+4nM. Assay description: Binding affinity to adrenoceptor alpha 1A (unknown origin)
Ligand InfoPC cidPC sid
In DepthDetails ArticlePubMed
TargetBeta-1 adrenergic receptor(Homo sapiens (Human))
University Of Mississippi
Curated by ChEMBL
LigandPNGBDBM50539742(CHEMBL4642292)
Affinity DataKi: >1.00E+4nM. Assay description: Binding affinity to beta1 adrenoceptor (unknown origin)
Ligand InfoPC cidPC sid
In DepthDetails ArticlePubMed
TargetAlpha-2C adrenergic receptor(Homo sapiens (Human))
University Of Mississippi
Curated by ChEMBL
LigandPNGBDBM50539742(CHEMBL4642292)
Affinity DataKi: >1.00E+4nM. Assay description: Binding affinity to adrenoceptor alpha 2C (unknown origin)
Ligand InfoPC cidPC sid
In DepthDetails ArticlePubMed
TargetD(1A) dopamine receptor(Homo sapiens (Human))
University Of Mississippi
Curated by ChEMBL
LigandPNGBDBM50539742(CHEMBL4642292)
Affinity DataKi: >1.00E+4nM. Assay description: Binding affinity to dopamine D1 receptor (unknown origin)
Ligand InfoPC cidPC sid
In DepthDetails ArticlePubMed
TargetD(2) dopamine receptor(Homo sapiens (Human))
University Of Mississippi
Curated by ChEMBL
LigandPNGBDBM50539742(CHEMBL4642292)
Affinity DataKi: >1.00E+4nM. Assay description: Binding affinity to dopamine D2 receptor (unknown origin)
Ligand InfoPC cidPC sid
In DepthDetails ArticlePubMed
TargetD(3) dopamine receptor(Homo sapiens (Human))
University Of Mississippi
Curated by ChEMBL
LigandPNGBDBM50539742(CHEMBL4642292)
Affinity DataKi: >1.00E+4nM. Assay description: Binding affinity to dopamine D3 receptor (unknown origin)
Ligand InfoPC cidPC sid
In DepthDetails ArticlePubMed
TargetD(4) dopamine receptor(Homo sapiens (Human))
University Of Mississippi
Curated by ChEMBL
LigandPNGBDBM50539742(CHEMBL4642292)
Affinity DataKi: >1.00E+4nM. Assay description: Binding affinity to dopamine D4 receptor (unknown origin)
Ligand InfoPC cidPC sid
In DepthDetails ArticlePubMed
TargetD(1B) dopamine receptor(Homo sapiens (Human))
University Of Mississippi
Curated by ChEMBL
LigandPNGBDBM50539742(CHEMBL4642292)
Affinity DataKi: >1.00E+4nM. Assay description: Binding affinity to dopamine D5 receptor (unknown origin)
Ligand InfoPC cidPC sid
In DepthDetails ArticlePubMed
TargetHistamine H1 receptor(Homo sapiens (Human))
University Of Mississippi
Curated by ChEMBL
LigandPNGBDBM50539742(CHEMBL4642292)
Affinity DataKi: >1.00E+4nM. Assay description: Binding affinity to histamine H1 receptor (unknown origin)
Ligand InfoPC cidPC sid
In DepthDetails ArticlePubMed
TargetHistamine H2 receptor(Homo sapiens (Human))
University Of Mississippi
Curated by ChEMBL
LigandPNGBDBM50539742(CHEMBL4642292)
Affinity DataKi: >1.00E+4nM. Assay description: Binding affinity to histamine H2 receptor (unknown origin)
Ligand InfoPC cidPC sid
In DepthDetails ArticlePubMed
TargetHistamine H3 receptor(Homo sapiens (Human))
University Of Mississippi
Curated by ChEMBL
LigandPNGBDBM50539742(CHEMBL4642292)
Affinity DataKi: >1.00E+4nM. Assay description: Binding affinity to histamine H3 receptor (unknown origin)
Ligand InfoPC cidPC sid
In DepthDetails ArticlePubMed
TargetHistamine H4 receptor(Homo sapiens (Human))
University Of Mississippi
Curated by ChEMBL
LigandPNGBDBM50539742(CHEMBL4642292)
Affinity DataKi: >1.00E+4nM. Assay description: Binding affinity to histamine H4 receptor (unknown origin)
Ligand InfoPC cidPC sid
In DepthDetails ArticlePubMed
TargetMuscarinic acetylcholine receptor M1(Homo sapiens (Human))
University Of Mississippi
Curated by ChEMBL
LigandPNGBDBM50539742(CHEMBL4642292)
Affinity DataKi: >1.00E+4nM. Assay description: Binding affinity to muscarinic acetylcholine receptor M1 (unknown origin)
Ligand InfoPC cidPC sid
In DepthDetails ArticlePubMed
TargetMuscarinic acetylcholine receptor M2(Homo sapiens (Human))
University Of Mississippi
Curated by ChEMBL
LigandPNGBDBM50539742(CHEMBL4642292)
Affinity DataKi: >1.00E+4nM. Assay description: Binding affinity to muscarinic acetylcholine receptor M2 (unknown origin)
Ligand InfoPC cidPC sid
In DepthDetails ArticlePubMed
TargetMuscarinic acetylcholine receptor M3(Homo sapiens (Human))
University Of Mississippi
Curated by ChEMBL
LigandPNGBDBM50539742(CHEMBL4642292)
Affinity DataKi: >1.00E+4nM. Assay description: Binding affinity to muscarinic acetylcholine receptor M3 (unknown origin)
Ligand InfoPC cidPC sid
In DepthDetails ArticlePubMed
TargetMuscarinic acetylcholine receptor M4(Homo sapiens (Human))
University Of Mississippi
Curated by ChEMBL
LigandPNGBDBM50539742(CHEMBL4642292)
Affinity DataKi: >1.00E+4nM. Assay description: Binding affinity to muscarinic acetylcholine receptor M4 (unknown origin)
Ligand InfoPC cidPC sid
In DepthDetails ArticlePubMed
TargetMuscarinic acetylcholine receptor M5(Homo sapiens (Human))
University Of Mississippi
Curated by ChEMBL
LigandPNGBDBM50539742(CHEMBL4642292)
Affinity DataKi: >1.00E+4nM. Assay description: Binding affinity to muscarinic acetylcholine receptor M5 (unknown origin)
Ligand InfoPC cidPC sid
In DepthDetails ArticlePubMed
TargetSodium-dependent serotonin transporter(Homo sapiens (Human))
University Of Mississippi
Curated by ChEMBL
LigandPNGBDBM50539742(CHEMBL4642292)
Affinity DataKi: >1.00E+4nM. Assay description: Binding affinity to SERT (unknown origin)
Ligand InfoPC cidPC sid
In DepthDetails ArticlePubMed
TargetSodium-dependent noradrenaline transporter(Homo sapiens (Human))
University Of Mississippi
Curated by ChEMBL
LigandPNGBDBM50539742(CHEMBL4642292)
Affinity DataKi: >1.00E+4nM. Assay description: Binding affinity to NET (unknown origin)
Ligand InfoPC cidPC sid
In DepthDetails ArticlePubMed
TargetSodium-dependent dopamine transporter(Homo sapiens (Human))
University Of Mississippi
Curated by ChEMBL
LigandPNGBDBM50539742(CHEMBL4642292)
Affinity DataKi: >1.00E+4nM. Assay description: Binding affinity to DAT (unknown origin)
Ligand InfoPC cidPC sid
In DepthDetails ArticlePubMed
TargetMu-type opioid receptor(Homo sapiens (Human))
University Of Mississippi
Curated by ChEMBL
LigandPNGBDBM50539742(CHEMBL4642292)
Affinity DataKi: >1.00E+4nM. Assay description: Binding affinity to MOR (unknown origin)
Ligand InfoPC cidPC sid
In DepthDetails ArticlePubMed
TargetDelta-type opioid receptor(Homo sapiens (Human))
University Of Mississippi
Curated by ChEMBL
LigandPNGBDBM50539742(CHEMBL4642292)
Affinity DataKi: >1.00E+4nM. Assay description: Binding affinity to DOR (unknown origin)
Ligand InfoPC cidPC sid
In DepthDetails ArticlePubMed
TargetKappa-type opioid receptor(Homo sapiens (Human))
University Of Mississippi
Curated by ChEMBL
LigandPNGBDBM50539742(CHEMBL4642292)
Affinity DataKi: >1.00E+4nM. Assay description: Binding affinity to KOR (unknown origin)
Ligand InfoPC cidPC sid
In DepthDetails ArticlePubMed
Target5-hydroxytryptamine receptor 1A(Homo sapiens (Human))
University Of Mississippi
Curated by ChEMBL
LigandPNGBDBM50539742(CHEMBL4642292)
Affinity DataKi: >1.00E+4nM. Assay description: Binding affinity to 5HT1A receptor (unknown origin)
Ligand InfoPC cidPC sid
In DepthDetails ArticlePubMed
Target5-hydroxytryptamine receptor 1B(Homo sapiens (Human))
University Of Mississippi
Curated by ChEMBL
LigandPNGBDBM50539742(CHEMBL4642292)
Affinity DataKi: >1.00E+4nM. Assay description: Binding affinity to 5HT1B receptor (unknown origin)
Ligand InfoPC cidPC sid
In DepthDetails ArticlePubMed
Target5-hydroxytryptamine receptor 1D(Homo sapiens (Human))
University Of Mississippi
Curated by ChEMBL
LigandPNGBDBM50539742(CHEMBL4642292)
Affinity DataKi: >1.00E+4nM. Assay description: Binding affinity to 5HT1D receptor (unknown origin)
Ligand InfoPC cidPC sid
In DepthDetails ArticlePubMed
Target5-hydroxytryptamine receptor 1E(Homo sapiens (Human))
University Of Mississippi
Curated by ChEMBL
LigandPNGBDBM50539742(CHEMBL4642292)
Affinity DataKi: >1.00E+4nM. Assay description: Binding affinity to 5HT1E receptor (unknown origin)
Ligand InfoPC cidPC sid
In DepthDetails ArticlePubMed
Target5-hydroxytryptamine receptor 2A(Homo sapiens (Human))
University Of Mississippi
Curated by ChEMBL
LigandPNGBDBM50539742(CHEMBL4642292)
Affinity DataKi: >1.00E+4nM. Assay description: Binding affinity to 5HT2A receptor (unknown origin)
Ligand InfoPC cidPC sid
In DepthDetails ArticlePubMed
Target5-hydroxytryptamine receptor 2C(Homo sapiens (Human))
University Of Mississippi
Curated by ChEMBL
LigandPNGBDBM50539742(CHEMBL4642292)
Affinity DataKi: >1.00E+4nM. Assay description: Binding affinity to 5HT2C receptor (unknown origin)
Ligand InfoPC cidPC sid
In DepthDetails ArticlePubMed
Target5-hydroxytryptamine receptor 3A(Homo sapiens (Human))
University Of Mississippi
Curated by ChEMBL
LigandPNGBDBM50539742(CHEMBL4642292)
Affinity DataKi: >1.00E+4nM. Assay description: Binding affinity to 5HT3 receptor (unknown origin)
Ligand InfoPC cidPC sid
In DepthDetails ArticlePubMed
Target5-hydroxytryptamine receptor 5A(Homo sapiens (Human))
University Of Mississippi
Curated by ChEMBL
LigandPNGBDBM50539742(CHEMBL4642292)
Affinity DataKi: >1.00E+4nM. Assay description: Binding affinity to 5HT5A receptor (unknown origin)
Ligand InfoPC cidPC sid
In DepthDetails ArticlePubMed
Target5-hydroxytryptamine receptor 6(Homo sapiens (Human))
University Of Mississippi
Curated by ChEMBL
LigandPNGBDBM50539742(CHEMBL4642292)
Affinity DataKi: >1.00E+4nM. Assay description: Binding affinity to 5HT6 receptor (unknown origin)
Ligand InfoPC cidPC sid
In DepthDetails ArticlePubMed
Target5-hydroxytryptamine receptor 7(Homo sapiens (Human))
University Of Mississippi
Curated by ChEMBL
LigandPNGBDBM50539742(CHEMBL4642292)
Affinity DataKi: >1.00E+4nM. Assay description: Binding affinity to 5HT7 receptor (unknown origin)
Ligand InfoPC cidPC sid
In DepthDetails ArticlePubMed
Target5-hydroxytryptamine receptor 7(Homo sapiens (Human))
University Of Mississippi
Curated by ChEMBL
LigandPNGBDBM50539742(CHEMBL4642292)
Affinity DataKi: >1.00E+4nM. Assay description: Binding affinity to 5HT7A receptor (unknown origin)
Ligand InfoPC cidPC sid
In DepthDetails ArticlePubMed
TargetSigma intracellular receptor 2(Homo sapiens (Human))
University Of Mississippi
Curated by ChEMBL
LigandPNGBDBM50539742(CHEMBL4642292)
Affinity DataKi: >1.00E+4nM. Assay description: Binding affinity to sigma2 receptor (unknown origin)
Ligand InfoPC cidPC sid
In DepthDetails ArticlePubMed
TargetAlpha-2B adrenergic receptor(Homo sapiens (Human))
University Of Mississippi
Curated by ChEMBL
LigandPNGBDBM50539742(CHEMBL4642292)
Affinity DataKi: >1.00E+4nM. Assay description: Binding affinity to adrenoceptor alpha 2B (unknown origin)
Ligand InfoPC cidPC sid
In DepthDetails ArticlePubMed
TargetAlpha-2A adrenergic receptor(Homo sapiens)
University Of Mississippi
Curated by ChEMBL
LigandPNGBDBM50539742(CHEMBL4642292)
Affinity DataKi: >1.00E+4nM. Assay description: Binding affinity to adrenoceptor alpha 2A (unknown origin)
Ligand InfoPC cidPC sid
In DepthDetails ArticlePubMed