BDBM50540458 CHEMBL4634230
SMILES [I-].C[N+](C)(C)CC1COCC(O1)(C1CCCCC1)c1ccccc1
InChI Key InChIKey=OQSMQUHQJAWCTB-UHFFFAOYSA-M
Data  5 KI
  Tab Delimited (TSV)   2D SDfile   Computed 3D by Vconf -m prep SDfile
Find this compound or compounds like it in BindingDB:
Activity Spreadsheet -- Enzyme Inhibition Constant Data from BindingDB
Found 5 hits for monomerid = 50540458
TargetMuscarinic acetylcholine receptor M1(Homo sapiens (Human))
Universit£
Curated by ChEMBL
LigandPNGBDBM50540458(CHEMBL4634230)
Affinity DataKi:  0.525nM. Assay description: Displacement of [3H]NMS from human recombinant muscarinic receptor M1 expressed in CHO-K1 cell membranes incubated for 2 hrs by scintillation countin...
Ligand InfoPC cidPC sid
In DepthDetails ArticlePubMed
TargetMuscarinic acetylcholine receptor M3(Homo sapiens (Human))
Universit£
Curated by ChEMBL
LigandPNGBDBM50540458(CHEMBL4634230)
Affinity DataKi:  0.851nM. Assay description: Displacement of [3H]NMS from human recombinant muscarinic receptor M3 expressed in CHO-K1 cell membranes incubated for 2 hrs by scintillation countin...
Ligand InfoPC cidPC sid
In DepthDetails ArticlePubMed
TargetMuscarinic acetylcholine receptor M4(Homo sapiens (Human))
Universit£
Curated by ChEMBL
LigandPNGBDBM50540458(CHEMBL4634230)
Affinity DataKi:  0.933nM. Assay description: Displacement of [3H]NMS from human recombinant muscarinic receptor M4 expressed in CHO-K1 cell membranes incubated for 2 hrs by scintillation countin...
Ligand InfoPC cidPC sid
In DepthDetails ArticlePubMed
TargetMuscarinic acetylcholine receptor M5(Homo sapiens (Human))
Universit£
Curated by ChEMBL
LigandPNGBDBM50540458(CHEMBL4634230)
Affinity DataKi:  3.90nM. Assay description: Displacement of [3H]NMS from human recombinant muscarinic receptor M5 expressed in CHO-K1 cell membranes incubated for 2 hrs by scintillation countin...
Ligand InfoPC cidPC sid
In DepthDetails ArticlePubMed
TargetMuscarinic acetylcholine receptor M2(Homo sapiens (Human))
Universit£
Curated by ChEMBL
LigandPNGBDBM50540458(CHEMBL4634230)
Affinity DataKi:  12nM. Assay description: Displacement of [3H]NMS from human recombinant muscarinic receptor M2 expressed in CHO-K1 cell membranes incubated for 2 hrs by scintillation countin...
Ligand InfoPC cidPC sid
In DepthDetails ArticlePubMed