BDBM50541831 CHEMBL4644535
SMILES CC(C)C[C@H](NC(=O)[C@H](CCCCN(C)C)NC(=O)[C@H](CO)NC(C)=O)C(N)=O
InChI Key InChIKey=ZKIYLBDBKFQLKH-JYJNAYRXSA-N
Data  1 IC50
  Tab Delimited (TSV)   2D SDfile   Computed 3D by Vconf -m prep SDfile
Find this compound or compounds like it in BindingDB:
Activity Spreadsheet -- Enzyme Inhibition Constant Data from BindingDB
Found 1 hit for monomerid = 50541831
TargetThrombospondin-1(Homo sapiens)
Southern Research Institute
Curated by ChEMBL
LigandPNGBDBM50541831(CHEMBL4644535)
Affinity DataIC50:  1.5nM. Assay description: Inhibition of TSP1 in human myeloma cells assessed reduction in TGFbeta activity incubated for 1 hr by ELISA
Ligand InfoKEGGPC cidPC sid
In DepthDetails ArticlePubMed