BDBM505421 8-chloro-4-(((R)-3-cyano-1- phenylpropyl)amino)-6-(((S)- (1-cyclopropyl-1H-1,2,3-triazol- 4-yl)(6-(oxetan-3-yl)-4,5,6,7- tetrahydrothieno[2,3-c]pyridin- 3-yl)methyl)amino)quinoline-3- carbonitrile::US11066414, Compound 84
SMILES Clc1cc(N[C@H](C2=CN(NN2)C2CC2)c2csc3CN(CCc23)C2COC2)cc2c(N[C@H](CCC#N)c3ccccc3)c(cnc12)C#N
InChI Key InChIKey=WBHMAYUZLXMJNE-PJTQZDKOSA-N
Data  1 IC50
  Tab Delimited (TSV)   2D SDfile   Computed 3D by Vconf -m prep SDfile
Find this compound or compounds like it in BindingDB:
Activity Spreadsheet -- Enzyme Inhibition Constant Data from BindingDB
Found 1 hit for monomerid = 505421
TargetEpidermal growth factor receptor(Homo sapiens (Human))
Gilead Sciences
US Patent
LigandPNGBDBM505421(8-chloro-4-(((R)-3-cyano-1- phenylpropyl)amino)-6-...)
Affinity DataIC50:  1nM. Assay description: EGFR activity was measured using KinEASE (Cisbio), a time-resolved fluorescence resonance energy transfer (TR-FRET) immunoassay. In this assay, EGFR-...
Ligand InfoPC cidPC sid
In DepthDetails US Patent