BDBM50542349 CHEMBL4649625
SMILES Cc1ccc(cc1)S(=O)(=O)N[C@H](CN1[C@@H](CC2CCCCC2)CNC1=N)Cc1ccc(O)cc1
InChI Key InChIKey=HXMQEUBJUDFHAF-GOTSBHOMSA-N
Data  1 IC50
  Tab Delimited (TSV)   2D SDfile   Computed 3D by Vconf -m prep SDfile
Find this compound or compounds like it in BindingDB:
Activity Spreadsheet -- Enzyme Inhibition Constant Data from BindingDB
Found 1 hit for monomerid = 50542349
TargetSerine/threonine-protein kinase LMTK3(Homo sapiens)
San Diego State University
Curated by ChEMBL
LigandPNGBDBM50542349(CHEMBL4649625)
Affinity DataIC50:  318nM. Assay description: Inhibition of LMTK3 (unknown origin)
Ligand InfoPC cidPC sid
In DepthDetails ArticlePubMed