BDBM50542350 CHEMBL4635320
SMILES CC(C)C[C@H]1CNC(=N)N1C[C@H](Cc1ccc(O)cc1)NS(=O)(=O)c1ccc(C)cc1
InChI Key InChIKey=LLBOYUQWZGNOOB-PMACEKPBSA-N
Data  1 IC50
  Tab Delimited (TSV)   2D SDfile   Computed 3D by Vconf -m prep SDfile
Find this compound or compounds like it in BindingDB:
Activity Spreadsheet -- Enzyme Inhibition Constant Data from BindingDB
Found 1 hit for monomerid = 50542350
TargetSerine/threonine-protein kinase LMTK3(Homo sapiens)
San Diego State University
Curated by ChEMBL
LigandPNGBDBM50542350(CHEMBL4635320)
Affinity DataIC50:  308nM. Assay description: Inhibition of LMTK3 (unknown origin)
Ligand InfoPC cidPC sid
In DepthDetails ArticlePubMed