BDBM50542698 CHEMBL4636059
SMILES CC(=O)c1ccc(cc1)N1C(=O)CC(S)C1=O
InChI Key InChIKey=CLSKRTVTNIYCQV-UHFFFAOYSA-N
Data  5 IC50
  Tab Delimited (TSV)   2D SDfile   Computed 3D by Vconf -m prep SDfile
Find this compound or compounds like it in BindingDB:
Activity Spreadsheet -- Enzyme Inhibition Constant Data from BindingDB
Found 5 hits for monomerid = 50542698
TargetElastase(Pseudomonas aeruginosa)
Helmholtz Institute For Pharmaceutical Research Saarland (Hips) - Helmholtz Centre For Infection Research (Hzi
Curated by ChEMBL
LigandPNGBDBM50542698(CHEMBL4636059)
Affinity DataIC50:  6.40E+4nM. Assay description: Inhibition of Pseudomonas aeruginosa PA14 LasB using 2-Aminobenzoyl-AlaGly-Leu-Ala-4-Nitrobenzylamide as fluorogenic substrate preincubated for 15 mi...
Ligand InfoPC cidPC sid
In DepthDetails ArticlePubMed
TargetCollagenase ColH(Hathewaya histolytica)
Helmholtz Institute For Pharmaceutical Research Saarland (Hips) - Helmholtz Centre For Infection Research (Hzi
Curated by ChEMBL
LigandPNGBDBM50542698(CHEMBL4636059)
Affinity DataIC50:  60nM. Assay description: Inhibition of Clostridium histolyticum ColH peptidase domain expressed in Escherichia coli BL21(DE3) cells using Mca-Ala-Gly-Pro-Pro-Gly-Pro-Dpa-Gly-...
Ligand InfoPC cidPC sid
In DepthDetails ArticlePubMed
TargetDisintegrin and metalloproteinase domain-containing protein 17(Homo sapiens (Human))
Helmholtz Institute For Pharmaceutical Research Saarland (Hips) - Helmholtz Centre For Infection Research (Hzi
Curated by ChEMBL
LigandPNGBDBM50542698(CHEMBL4636059)
Affinity DataIC50:  3.40E+3nM. Assay description: Inhibition of recombinant human TACE1 expressed in insect cells using FRET-tagged substrate by FRET assay
Ligand InfoPC cidPC sid
In DepthDetails ArticlePubMed
TargetHistone deacetylase 8(Homo sapiens (Human))
Helmholtz Institute For Pharmaceutical Research Saarland (Hips) - Helmholtz Centre For Infection Research (Hzi
Curated by ChEMBL
LigandPNGBDBM50542698(CHEMBL4636059)
Affinity DataIC50: >1.00E+5nM. Assay description: Inhibition of recombinant human HDAC8 expressed in baculovirus infected insect cells using R-H-K(Ac)-K(Ac)-AFC as substrate by fluorescence assay
Ligand InfoPC cidPC sid
In DepthDetails ArticlePubMed
TargetHistone deacetylase 3(Homo sapiens (Human))
Helmholtz Institute For Pharmaceutical Research Saarland (Hips) - Helmholtz Centre For Infection Research (Hzi
Curated by ChEMBL
LigandPNGBDBM50542698(CHEMBL4636059)
Affinity DataIC50: >1.00E+5nM. Assay description: Inhibition of recombinant human HDAC3 expressed in insect cells using R-H-K-K(Ac)-AFC as substrate by fluorescence assay
Ligand InfoPC cidPC sid
In DepthDetails ArticlePubMed