BDBM50543144 CHEMBL4642538
SMILES Cc1cc(=O)n(C)cc1-c1cc(C)c2nn(cc2c1)C1CCNCC1
InChI Key InChIKey=YLCPXJJLBZHNTE-UHFFFAOYSA-N
Data  5 IC50
  Tab Delimited (TSV)   2D SDfile   Computed 3D by Vconf -m prep SDfile
Find this compound or compounds like it in BindingDB:
Activity Spreadsheet -- Enzyme Inhibition Constant Data from BindingDB
Found 5 hits for monomerid = 50543144
TargetToll-like receptor 8(Homo sapiens (Human))
Genomics Institute Of The Novartis Research Foundation
Curated by ChEMBL
LigandPNGBDBM50543144(CHEMBL4642538)
Affinity DataIC50:  1.90E+4nM. Assay description: Displacement of 2-((1E,3E,5E)-5-(3,3-Dimethyl-1-(6-((4-(((3-methyl-5-(1H-pyrazolo[3,4-b]pyridin-4-yl)pyridin-2-yl)oxy)methyl)bicyclo[2.2.2]octan-1-yl...
Ligand InfoPC cidPC sid
In DepthDetails ArticlePubMed
TargetToll-like receptor 4(Homo sapiens (Human))
Genomics Institute Of The Novartis Research Foundation
Curated by ChEMBL
LigandPNGBDBM50543144(CHEMBL4642538)
Affinity DataIC50: >4.20E+3nM. Assay description: Antagonist activity at TLR4 in human PBMC assessed as inhibition of LPS-induced TNFalpha production preincubated for 30 mins followed by LPS addition...
Ligand InfoPC cidPC sid
In DepthDetails ArticlePubMed
TargetToll-like receptor 9(Homo sapiens (Human))
Genomics Institute Of The Novartis Research Foundation
Curated by ChEMBL
LigandPNGBDBM50543144(CHEMBL4642538)
Affinity DataIC50:  7.20E+3nM. Assay description: Antagonist activity at TLR9 in human PBMC assessed as inhibition of ODN2216-induced IFNalpha production preincubated for 30 mins followed by ODN2216 ...
Ligand InfoPC cidPC sid
In DepthDetails ArticlePubMed
TargetToll-like receptor 8(Homo sapiens (Human))
Genomics Institute Of The Novartis Research Foundation
Curated by ChEMBL
LigandPNGBDBM50543144(CHEMBL4642538)
Affinity DataIC50:  76nM. Assay description: Antagonist activity at TLR8 in human PBMC assessed as inhibition of DOTAP-ssRNA40 induced TNFalpha production preincubated for 30 mins followed by ss...
Ligand InfoPC cidPC sid
In DepthDetails ArticlePubMed
TargetToll-like receptor 7(Homo sapiens (Human))
Genomics Institute Of The Novartis Research Foundation
Curated by ChEMBL
LigandPNGBDBM50543144(CHEMBL4642538)
Affinity DataIC50:  14nM. Assay description: Antagonist activity at TLR7 in human PBMC assessed as inhibition of DOTAP-ssRNA40 induced IFNalpha production preincubated for 30 mins followed by ss...
Ligand InfoPC cidPC sid
In DepthDetails ArticlePubMed