BDBM50543157 CHEMBL4635744
SMILES Cc1cc(cc2cn(nc12)C1CNCCC1(F)F)-c1ccc(=O)n(C)c1C
InChI Key InChIKey=QFKVQAHXWNDICZ-UHFFFAOYSA-N
Data  2 IC50
  Tab Delimited (TSV)   2D SDfile   Computed 3D by Vconf -m prep SDfile
Find this compound or compounds like it in BindingDB:
Activity Spreadsheet -- Enzyme Inhibition Constant Data from BindingDB
Found 2 hits for monomerid = 50543157
TargetToll-like receptor 8(Homo sapiens (Human))
Genomics Institute Of The Novartis Research Foundation
Curated by ChEMBL
LigandPNGBDBM50543157(CHEMBL4635744)
Affinity DataIC50:  300nM. Assay description: Antagonist activity at TLR8 in human PBMC assessed as inhibition of DOTAP-ssRNA40 induced TNFalpha production preincubated for 30 mins followed by ss...
Ligand InfoPC cidPC sid
In DepthDetails ArticlePubMed
TargetToll-like receptor 8(Homo sapiens (Human))
Genomics Institute Of The Novartis Research Foundation
Curated by ChEMBL
LigandPNGBDBM50543157(CHEMBL4635744)
Affinity DataIC50:  1.40E+3nM. Assay description: Displacement of 2-((1E,3E,5E)-5-(3,3-Dimethyl-1-(6-((4-(((3-methyl-5-(1H-pyrazolo[3,4-b]pyridin-4-yl)pyridin-2-yl)oxy)methyl)bicyclo[2.2.2]octan-1-yl...
Ligand InfoPC cidPC sid
In DepthDetails ArticlePubMed