BDBM50543172 CHEMBL4636951
SMILES Cc1cc(C(O)=O)c(C)n1C
InChI Key InChIKey=JTEBLTWGSAXWEE-UHFFFAOYSA-N
Data  1 IC50
PDB links: 1 PDB ID matches this monomer.
  Tab Delimited (TSV)   2D SDfile   Computed 3D by Vconf -m prep SDfile
Find this compound or compounds like it in BindingDB:
Activity Spreadsheet -- Enzyme Inhibition Constant Data from BindingDB
Found 1 hit for monomerid = 50543172
TargetPalmitoleoyl-protein carboxylesterase NOTUM(Homo sapiens (Human))
University College London
Curated by ChEMBL
LigandPNGBDBM50543172(CHEMBL4636951)
Affinity DataIC50: >1.00E+5nM. Assay description: Inhibition of human Notum (S81 to T451 residues) Cys330Ser mutant expressed in HEK293S GnTI cells using OPTS as substrate incubated for 40 mins by fl...
In DepthDetails ArticlePubMed