BDBM50543319 CHEMBL4639260
SMILES O=C(N1CCC(C1)N1CCc2ccccc2C1)c1c[nH]c2ccccc12
InChI Key
Data  2 Kd
  Tab Delimited (TSV)   2D SDfile   Computed 3D by Vconf -m prep SDfile
Find this compound or compounds like it in BindingDB:
Activity Spreadsheet -- Enzyme Inhibition Constant Data from BindingDB
Found 2 hits for monomerid = 50543319
TargetSigma intracellular receptor 2(Homo sapiens (Human))
Harvard Medical School
Curated by ChEMBL
LigandPNGBDBM50543319(CHEMBL4639260)
Affinity DataKd: >1.00E+3nM. Assay description: Displacement of [3H](+)-DTG from recombinant sigma 2 receptor (unknown origin) expressed in baculovirus infected Sf9 cell membranes after 1.5 hrs by ...
In DepthDetails ArticlePubMed
TargetSigma non-opioid intracellular receptor 1(Homo sapiens (Human))
Harvard Medical School
Curated by ChEMBL
LigandPNGBDBM50543319(CHEMBL4639260)
Affinity DataKd: >1.00E+3nM. Assay description: Displacement of [3H](+)-pentazocine from recombinant sigma 1 receptor (unknown origin) expressed in baculovirus infected Sf9 cell membranes after 1.5...
In DepthDetails ArticlePubMed