BDBM50544712 CHEMBL4635203
SMILES COc1cc(NC(=O)CCC2CCCN(Cc3ccc(F)c(OC)c3)C2)cc(OC)c1
InChI Key InChIKey=MSRNULIQIBVDIP-UHFFFAOYSA-N
Data  1 IC50
  Tab Delimited (TSV)   2D SDfile   Computed 3D by Vconf -m prep SDfile
Find this compound or compounds like it in BindingDB:
Activity Spreadsheet -- Enzyme Inhibition Constant Data from BindingDB
Found 1 hit for monomerid = 50544712
TargetTAR DNA-binding protein 43(Homo sapiens)
Astrazeneca
Curated by ChEMBL
LigandPNGBDBM50544712(CHEMBL4635203)
Affinity DataIC50:  100nM. Assay description: Inhibition of TDP-43 (unknown origin) binding to RNA
In DepthDetails ArticlePubMed