BDBM50546857 CHEMBL4757755
SMILES Fc1ccc(cc1Cl)C(=O)N1CCC(F)(CNCCOc2cccc3NCCc23)CC1
InChI Key InChIKey=PKCZHVJFTWAZHM-UHFFFAOYSA-N
Data  3 KI  4 EC50
  Tab Delimited (TSV)   2D SDfile   Computed 3D by Vconf -m prep SDfile
Find this compound or compounds like it in BindingDB:
Activity Spreadsheet -- Enzyme Inhibition Constant Data from BindingDB
Found 7 hits for monomerid = 50546857
Target5-hydroxytryptamine receptor 1A(Homo sapiens (Human))
Jagiellonian University Medical College
Curated by ChEMBL
LigandPNGBDBM50546857(CHEMBL4757755)
Affinity DataKi:  0.0447nM. Assay description: Displacement of [3H]8-OH-DPAT from human 5-HT1A receptor stably expressed in CHO-K1 cell membranes measured after 60 mins by Microbeta2 scintillation...
Ligand InfoPC cidPC sid
In DepthDetails PubMed
TargetAlpha-1A/Alpha-1B/Alpha-1D adrenergic receptor(Rattus norvegicus (rat))
Jagiellonian University Medical College
Curated by ChEMBL
LigandPNGBDBM50546857(CHEMBL4757755)
Affinity DataKi:  437nM. Assay description: Displacement of [3H]prazosin from alpha1 adrenergic receptor in rat cortex membranes measured after 30 mins by Microbeta2 scintillation counting meth...
Ligand InfoPC cidPC sid
In DepthDetails PubMed
TargetD(2) dopamine receptor(Homo sapiens (Human))
Jagiellonian University Medical College
Curated by ChEMBL
LigandPNGBDBM50546857(CHEMBL4757755)
Affinity DataKi: <1.00E+3nM. Assay description: Displacement of [3H]methylspiperone from human D2 receptor stably expressed in CHO-K1 cell membranes measured after 60 mins by Microbeta2 scintillati...
Ligand InfoPC cidPC sid
In DepthDetails PubMed
Target5-hydroxytryptamine receptor 1A(Homo sapiens (Human))
Jagiellonian University Medical College
Curated by ChEMBL
LigandPNGBDBM50546857(CHEMBL4757755)
Affinity DataEC50:  0.00513nM. Assay description: Biased agonist activity at Gal4-VP16 transcription factor linked human 5-HT1A receptor expressed in human U2OS cells assessed as induction of beta-ar...
Ligand InfoPC cidPC sid
In DepthDetails PubMed
Target5-hydroxytryptamine receptor 1A(Homo sapiens (Human))
Jagiellonian University Medical College
Curated by ChEMBL
LigandPNGBDBM50546857(CHEMBL4757755)
Affinity DataEC50:  0.0132nM. Assay description: Biased agonist activity at human 5-HT1A receptor stably expressed in CHO-K1 cells assessed as inhibition of forskolin-induced cAMP accumulation after...
Ligand InfoPC cidPC sid
In DepthDetails PubMed
Target5-hydroxytryptamine receptor 1A(Homo sapiens (Human))
Jagiellonian University Medical College
Curated by ChEMBL
LigandPNGBDBM50546857(CHEMBL4757755)
Affinity DataEC50:  3.5nM. Assay description: Biased agonist activity at human 5-HT1A receptor stably expressed in CHO-K1 cells co-expressing Galpha16/GPCR assessed as increase in calcium mobiliz...
Ligand InfoPC cidPC sid
In DepthDetails PubMed
Target5-hydroxytryptamine receptor 1A(Homo sapiens (Human))
Jagiellonian University Medical College
Curated by ChEMBL
LigandPNGBDBM50546857(CHEMBL4757755)
Affinity DataEC50:  0.00363nM. Assay description: Biased agonist activity at human 5-HT1A receptor stably expressed in CHO-K1 cells assessed as increase in ERK1/2 phosphorylation after 15 mins by Alp...
Ligand InfoPC cidPC sid
In DepthDetails PubMed