BDBM50547498 CHEMBL4755909
SMILES CN(C)c1ccc(\C=C\C=C2/CCC=CC2=O)cc1
InChI Key InChIKey=ZEDLHDKTUKZGOJ-DQICWPNBSA-N
Data  1 IC50
  Tab Delimited (TSV)   2D SDfile   Computed 3D by Vconf -m prep SDfile
Find this compound or compounds like it in BindingDB:
Activity Spreadsheet -- Enzyme Inhibition Constant Data from BindingDB
Found 1 hit for monomerid = 50547498
TargetThioredoxin reductase 1, cytoplasmic(Homo sapiens (Human))
Nantong University
Curated by ChEMBL
LigandPNGBDBM50547498(CHEMBL4755909)
Affinity DataIC50:  200nM. Assay description: Inhibition of TrxR in human BEL-7402/5-FU cells by colorimetric assay
Ligand InfoPC cidPC sid
In DepthDetails ArticlePubMed