BDBM50548069 CHEMBL4741670
SMILES CCCC[C@H]1C[C@@H](C1)C(=O)NC[C@H]1CCCN1C(=O)[C@@H](NC(=S)CNC)C(C)(C)C
InChI Key InChIKey=PZXSDLFLQDLPKZ-SOAMZJECSA-N
Data  1 IC50
  Tab Delimited (TSV)   2D SDfile   Computed 3D by Vconf -m prep SDfile
Find this compound or compounds like it in BindingDB:
Activity Spreadsheet -- Enzyme Inhibition Constant Data from BindingDB
Found 1 hit for monomerid = 50548069
TargetGhrelin O-acyltransferase(Mus musculus)
National Institute On Alcohol Abuse And Alcoholism
Curated by ChEMBL
LigandPNGBDBM50548069(CHEMBL4741670)
Affinity DataIC50:  30nM. Assay description: Inhibition of N-terminal His10-tagged mouse GOAT expressed in baculovirus infected sf9 insect cell membrane using proghrelin-His8 and [3H]octanoyl Co...
Ligand InfoPC cidPC sid
In DepthDetails ArticlePubMed