BDBM50548172 CHEMBL4788784
SMILES N[C@@H]1CCCCNC(=O)CC[C@@H](NC(=O)[C@H](CC(O)=O)NC(=O)[C@H](Cc2c[nH]c3ccccc23)NC(=O)[C@H](CCCNC(N)=N)NC(=O)[C@H](CO)NC1=O)C(=O)N[C@@H](Cc1c[nH]c2ccccc12)C(O)=O
InChI Key
Data  1 Kd
  Tab Delimited (TSV)   2D SDfile   Computed 3D by Vconf -m prep SDfile
Find this compound or compounds like it in BindingDB:
Activity Spreadsheet -- Enzyme Inhibition Constant Data from BindingDB
Found 1 hit for monomerid = 50548172
TargetSplicing factor 45(Homo sapiens)
Helmholtz Zentrum M�Nchen
Curated by ChEMBL
LigandPNGBDBM50548172(CHEMBL4788784)
Affinity DataKd:  800nM. Assay description: Binding affinity to His-Z-tagged SPF45 (unknown origin) UHM domain expressed in Escherichia coli BL21 (DE3) cells by ITC analysis
Ligand InfoPC cidPC sid
In DepthDetails ArticlePubMed