BDBM50548176 CHEMBL4747647
SMILES NCCCC[C@H](NC(=O)[C@H]1CCC(=O)NCCCC[C@@H](N)C(=O)N[C@@H](CO)C(=O)N[C@@H](CCCNC(N)=N)C(=O)N[C@@H](Cc2c[nH]c3ccccc23)C(=O)N[C@@H](CC(O)=O)C(=O)N1)C(O)=O
InChI Key
Data  1 Kd
  Tab Delimited (TSV)   2D SDfile   Computed 3D by Vconf -m prep SDfile
Find this compound or compounds like it in BindingDB:
Activity Spreadsheet -- Enzyme Inhibition Constant Data from BindingDB
Found 1 hit for monomerid = 50548176
TargetSplicing factor 45(Homo sapiens)
Helmholtz Zentrum M�Nchen
Curated by ChEMBL
LigandPNGBDBM50548176(CHEMBL4747647)
Affinity DataKd:  180nM. Assay description: Binding affinity to His-Z-tagged SPF45 (unknown origin) UHM domain expressed in Escherichia coli BL21 (DE3) cells by ITC analysis
Ligand InfoPC cidPC sid
In DepthDetails ArticlePubMed