BDBM50549238 CHEMBL4781167
SMILES Cc1ccc(\C=C\C2=C(CCCC2)/C=N/O)cc1
InChI Key InChIKey=XAVAXLWOXGYLEN-SXSSDGSKSA-N
Data  1 IC50
  Tab Delimited (TSV)   2D SDfile   Computed 3D by Vconf -m prep SDfile
Find this compound or compounds like it in BindingDB:
Activity Spreadsheet -- Enzyme Inhibition Constant Data from BindingDB
Found 1 hit for monomerid = 50549238
TargetFibroblast growth factor 23(Homo sapiens)
Tennessee Technological University
Curated by ChEMBL
LigandPNGBDBM50549238(CHEMBL4781167)
Affinity DataIC50:  520nM. Assay description: Inhibition of FGF23 (unknown origin)-mediated activation of FGFR/alpha-Klotho transfected in HEK293T cells cotransfected with ERK luciferase reporter...
Ligand InfoKEGGPC cidPC sid
In DepthDetails ArticlePubMed