BDBM50552132 Spiropiperidine
SMILES O=C(NC(Cc1c[nH]c2ccccc12)C(=O)N1CCC2(CCc3ccccc23)CC1)NC1CN2CCC1CC2
InChI Key
Data  1 EC50
  Tab Delimited (TSV)   2D SDfile   Computed 3D by Vconf -m prep SDfile
Find this compound or compounds like it in BindingDB:
Activity Spreadsheet -- Enzyme Inhibition Constant Data from BindingDB
Found 1 hit for monomerid = 50552132
TargetGrowth hormone secretagogue receptor type 1(Rattus norvegicus)
St. John'S University
Curated by ChEMBL
LigandPNGBDBM50552132(Spiropiperidine)
Affinity DataEC50:  50nM. Assay description: Agonist activity at GHSR in Wistar rat pituitary gland cells assessed as induction of GH release by RIA
Ligand InfoPC cidPC sid
In DepthDetails ArticlePubMed