BDBM50555250 CHEMBL4752826
SMILES C[C@@H](O)[C@H](NC(=O)[C@@H](NC(=O)[C@H](CCC(N)=O)NC(=O)[C@H](Cc1c[nH]c2ccccc12)NC(=O)[C@H](Cc1ccc2ccccc2c1)NC(=O)[C@H](CCCNC(N)=N)NC(=O)[C@@H](CCCNC(N)=N)NC(=O)[C@H](CCCNC(N)=N)NC(=O)[C@H](CS)NC(C)=O)C(C)(C)S)C(=O)N[C@@H](CCCNC(N)=N)C(=O)N[C@H](C(O)=O)C(C)(C)C
InChI Key
Data  1 IC50
  Tab Delimited (TSV)   2D SDfile   Computed 3D by Vconf -m prep SDfile
Find this compound or compounds like it in BindingDB:
Activity Spreadsheet -- Enzyme Inhibition Constant Data from BindingDB
Found 1 hit for monomerid = 50555250
TargetGolgi-associated PDZ and coiled-coil motif-containing protein(Homo sapiens)
The Ohio State University
Curated by ChEMBL
LigandPNGBDBM50555250(CHEMBL4752826)
Affinity DataIC50:  400nM. Assay description: Binding affinity to C-terminal His6 tagged CAL PDZ domain (unknown origin) expressed in Escherichia coli BL21 incubated for 1 hr using FAM-22 probe b...
Ligand InfoKEGGPC cidPC sid
In DepthDetails ArticlePubMed