BDBM50557063 CHEMBL4761882
SMILES O[C@@H]1CCN(C1)c1cc(nc(n1)N1CCC[C@H](C1)c1ccccc1)C(=O)NCC1CC1
InChI Key InChIKey=GFHJYPQZBBHOCC-WOJBJXKFSA-N
Data  2 IC50
  Tab Delimited (TSV)   2D SDfile   Computed 3D by Vconf -m prep SDfile
Find this compound or compounds like it in BindingDB:
Activity Spreadsheet -- Enzyme Inhibition Constant Data from BindingDB
Found 2 hits for monomerid = 50557063
TargetN-acyl-phosphatidylethanolamine-hydrolyzing phospholipase D(Mus musculus)
Leiden University And Oncode Institute
Curated by ChEMBL
LigandPNGBDBM50557063(CHEMBL4761882)
Affinity DataIC50:  380nM. Assay description: Inhibition of full length mouse NAPE-PLD expressed in HEK293T cell lysate using PED6 as substrate preincubated for 30 mins followed by substrate addi...
Ligand InfoPC cidPC sid
In DepthDetails ArticlePubMed
TargetN-acyl-phosphatidylethanolamine-hydrolyzing phospholipase D(Homo sapiens)
Leiden University And Oncode Institute
Curated by ChEMBL
LigandPNGBDBM50557063(CHEMBL4761882)
Affinity DataIC50:  110nM. Assay description: Inhibition of full length human NAPE-PLD expressed in HEK293T cell lysate using PED6 as substrate preincubated for 30 mins followed by substrate addi...
Ligand InfoPC cidPC sid
In DepthDetails ArticlePubMed