BDBM50557295 CHEMBL4758599
SMILES CC[C@H](C)[C@H](NC(=O)[C@H](CC(O)=O)NC(=O)[C@@H](NC(=O)[C@@H](NC(=O)[C@H](Cc1c[nH]c2ccccc12)NC(=O)[C@H](Cc1cnc[nH]1)NC(=O)[C@H](CO)NC(=O)[C@H](CCC=O)NC(=O)[C@@H](CCCNC(N)=N)NC(=O)[C@H](CCCNC(N)=N)NC(=O)[C@@H](CCCCN)NC(=O)[C@H](CCCCN)NC(=O)[C@@H](CCCNC(N)=N)NC(=O)CNC(=O)[C@@H](CCCNC(N)=N)NC(=O)[C@H](CCCNC(N)=N)NC(=O)[C@@H](CCCNC(N)=N)NC(=O)[C@H](CCCCN)NC(C)=O)C(C)(C)C)C1CCCCC1)C(O)=O
InChI Key
Data  1 KI
  Tab Delimited (TSV)   2D SDfile   Computed 3D by Vconf -m prep SDfile
Find this compound or compounds like it in BindingDB:
Activity Spreadsheet -- Enzyme Inhibition Constant Data from BindingDB
Found 1 hit for monomerid = 50557295
TargetSyntenin-1(Homo sapiens)
University Of Copenhagen
Curated by ChEMBL
LigandPNGBDBM50557295(CHEMBL4758599)
Affinity DataKi:  250nM. Assay description: Inhibition of syntenin-PDZ1-2 domain (unknown origin) expressed in Escherichia coli BL21 (DE3) incubated for 5 mins by fluorescence polarization assa...
Ligand InfoKEGGPC cidPC sid
In DepthDetails ArticlePubMed