BDBM50557492 CHEMBL4754146
SMILES NS(=O)(=O)c1cccc(c1)-c1nnc(o1)-c1ccc(Cl)cc1Cl
InChI Key InChIKey=PILVRGRTYTVVBH-UHFFFAOYSA-N
Data  4 KI
  Tab Delimited (TSV)   2D SDfile   Computed 3D by Vconf -m prep SDfile
Find this compound or compounds like it in BindingDB:
Activity Spreadsheet -- Enzyme Inhibition Constant Data from BindingDB
Found 4 hits for monomerid = 50557492
TargetCarbonic anhydrase 13(Homo sapiens (Human))
National Institute Of Pharmaceutical Education And Research (Niper)
Curated by ChEMBL
LigandPNGBDBM50557492(CHEMBL4754146)
Affinity DataKi:  15nM. Assay description: Inhibition of recombinant human carbonic anhydrase 13 by stopped flow CO2 hydrase assay
Ligand InfoPC cidPC sid
In DepthDetails ArticlePubMed
TargetCarbonic anhydrase 1(Homo sapiens (Human))
National Institute Of Pharmaceutical Education And Research (Niper)
Curated by ChEMBL
LigandPNGBDBM50557492(CHEMBL4754146)
Affinity DataKi:  76nM. Assay description: Inhibition of recombinant human carbonic anhydrase 1 by stopped flow CO2 hydrase assay
Ligand InfoPC cidPC sid
In DepthDetails ArticlePubMed
TargetCarbonic anhydrase 9(Homo sapiens (Human))
National Institute Of Pharmaceutical Education And Research (Niper)
Curated by ChEMBL
LigandPNGBDBM50557492(CHEMBL4754146)
Affinity DataKi:  76nM. Assay description: Inhibition of recombinant human carbonic anhydrase 9 by stopped flow CO2 hydrase assay
Ligand InfoPC cidPC sid
In DepthDetails ArticlePubMed
TargetCarbonic anhydrase 2(Homo sapiens (Human))
National Institute Of Pharmaceutical Education And Research (Niper)
Curated by ChEMBL
LigandPNGBDBM50557492(CHEMBL4754146)
Affinity DataKi:  90nM. Assay description: Inhibition of recombinant human carbonic anhydrase 2 by stopped flow CO2 hydrase assay
Ligand InfoPC cidPC sid
In DepthDetails ArticlePubMed