BDBM50557678 CHEMBL4754084
SMILES C[C@H](NC(=O)c1cc(nn1C)C(F)(F)F)c1nc(no1)-c1ccnc(c1)C(F)F
InChI Key InChIKey=MCURJTIQCCBRFF-ZETCQYMHSA-N
Data  2 IC50
  Tab Delimited (TSV)   2D SDfile   Computed 3D by Vconf -m prep SDfile
Find this compound or compounds like it in BindingDB:
Activity Spreadsheet -- Enzyme Inhibition Constant Data from BindingDB
Found 2 hits for monomerid = 50557678
TargetPotassium channel subfamily T member 1(Mus musculus)
Praxis Precision Medicines
Curated by ChEMBL
LigandPNGBDBM50557678(CHEMBL4754084)
Affinity DataIC50:  1.25E+3nM. Assay description: Inhibition of recombinant wild type mouse KNa1.1 expressed in human HEK-TREX cells at -80 mV holding potential by automated patch clamp assay
Ligand InfoPC cidPC sid
In DepthDetails ArticlePubMed
TargetPotassium channel subfamily T member 1(Homo sapiens)
Praxis Precision Medicines
Curated by ChEMBL
LigandPNGBDBM50557678(CHEMBL4754084)
Affinity DataIC50:  61nM. Assay description: Inhibition of recombinant wild type human KNa1.1 expressed in human HEK-TREX cells at -80 mV holding potential by automated patch clamp assay
Ligand InfoPC cidPC sid
In DepthDetails ArticlePubMed