BDBM50557683 CHEMBL4758890
SMILES CO[C@H](C)c1cc(ccn1)-c1noc(n1)[C@H](C)NC(=O)c1cc(nn1C)C(F)(F)F
InChI Key InChIKey=JQXRZMLQJILMDA-VHSXEESVSA-N
Data  1 IC50
  Tab Delimited (TSV)   2D SDfile   Computed 3D by Vconf -m prep SDfile
Find this compound or compounds like it in BindingDB:
Activity Spreadsheet -- Enzyme Inhibition Constant Data from BindingDB
Found 1 hit for monomerid = 50557683
TargetPotassium channel subfamily T member 1(Homo sapiens)
Praxis Precision Medicines
Curated by ChEMBL
LigandPNGBDBM50557683(CHEMBL4758890)
Affinity DataIC50:  778nM. Assay description: Inhibition of recombinant wild type human KNa1.1 expressed in human HEK-TREX cells at -80 mV holding potential by automated patch clamp assay
Ligand InfoPC cidPC sid
In DepthDetails ArticlePubMed