BDBM50557836 CHEMBL4752151
SMILES OC(SCC(O)=O)C(=O)c1ccccc1
InChI Key InChIKey=PXMFTQGDYRMEFO-UHFFFAOYSA-N
Data  1 IC50
  Tab Delimited (TSV)   2D SDfile   Computed 3D by Vconf -m prep SDfile
Find this compound or compounds like it in BindingDB:
Activity Spreadsheet -- Enzyme Inhibition Constant Data from BindingDB
Found 1 hit for monomerid = 50557836
TargetRNA demethylase ALKBH5(Homo sapiens)
Smith, Gambrell & Russell
Curated by ChEMBL
LigandPNGBDBM50557836(CHEMBL4752151)
Affinity DataIC50:  840nM. Assay description: Inhibition of ALKBH5 demethylase activity (unknown origin) assessed as increase in methylated 6A-RNA level incubated for 2 hrs by colorimetric analys...
In DepthDetails ArticlePubMed