BDBM50560840 CHEMBL4753103
SMILES CCCCCCCCCCCOc1ccccc1CCC(=O)O[C@@H]1CCOC[C@H]1OP(O)(=O)OC[C@H](N)C(O)=O
InChI Key InChIKey=WTHILFAMRXZBRN-SKBVVQJISA-N
Data  10 EC50
  Tab Delimited (TSV)   2D SDfile   Computed 3D by Vconf -m prep SDfile
Find this compound or compounds like it in BindingDB:
Activity Spreadsheet -- Enzyme Inhibition Constant Data from BindingDB
Found 10 hits for monomerid = 50560840
TargetProbable G-protein coupled receptor 34(Mus musculus)
The University Of Tokyo
Curated by ChEMBL
LigandPNGBDBM50560840(CHEMBL4753103)
Affinity DataEC50:  0.830nM. Assay description: Agonist activity at mouse GPR34 expressed in HEK293 cells co-transfected with AP-TGFalpha/Galphaq/i1 assessed as induction of ectodomain shedding of ...
Ligand InfoPC cidPC sid
In DepthDetails ArticlePubMed
TargetProbable G-protein coupled receptor 34(Mus musculus)
The University Of Tokyo
Curated by ChEMBL
LigandPNGBDBM50560840(CHEMBL4753103)
Affinity DataEC50:  0.832nM. Assay description: Agonist activity at mouse GPR34 expressed in HEK293 cells co-transfected with AP-TGFalpha/Galphaq/i1 assessed as induction of ectodomain shedding of ...
Ligand InfoPC cidPC sid
In DepthDetails ArticlePubMed
TargetPutative P2Y purinoceptor 10(Mus musculus)
The University Of Tokyo
Curated by ChEMBL
LigandPNGBDBM50560840(CHEMBL4753103)
Affinity DataEC50:  1nM. Assay description: Agonist activity at mouse P2Y10 expressed in HEK293 cells co-transfected with AP-TGFalpha/Galphaq/i1 assessed as induction of ectodomain shedding of ...
Ligand InfoPC cidPC sid
In DepthDetails ArticlePubMed
TargetPutative P2Y purinoceptor 10(Mus musculus)
The University Of Tokyo
Curated by ChEMBL
LigandPNGBDBM50560840(CHEMBL4753103)
Affinity DataEC50:  0.977nM. Assay description: Agonist activity at mouse P2Y10 expressed in HEK293 cells co-transfected with AP-TGFalpha/Galphaq/i1 assessed as induction of ectodomain shedding of ...
Ligand InfoPC cidPC sid
In DepthDetails ArticlePubMed
TargetG protein-coupled receptor 34b(Danio rerio)
The University Of Tokyo
Curated by ChEMBL
LigandPNGBDBM50560840(CHEMBL4753103)
Affinity DataEC50:  11nM. Assay description: Agonist activity at zebrafish GPR34 type b expressed in HEK293 cells co-transfected with AP-TGFalpha/Galphaq/i1 assessed as induction of ectodomain s...
Ligand InfoPC cidPC sid
In DepthDetails ArticlePubMed
TargetProbable G-protein coupled receptor 34(Homo sapiens (Human))
The University Of Tokyo
Curated by ChEMBL
LigandPNGBDBM50560840(CHEMBL4753103)
Affinity DataEC50:  0.759nM. Assay description: Agonist activity at human GPR34 expressed in HEK293 cells co-transfected with AP-TGFalpha/Galphaq/i1 assessed as induction of ectodomain shedding of ...
Ligand InfoPC cidPC sid
In DepthDetails ArticlePubMed
TargetG protein-coupled receptor 34a(Danio rerio)
The University Of Tokyo
Curated by ChEMBL
LigandPNGBDBM50560840(CHEMBL4753103)
Affinity DataEC50:  510nM. Assay description: Agonist activity at zebrafish GPR34 type a expressed in HEK293 cells co-transfected with AP-TGFalpha/Galphaq/i1 assessed as induction of ectodomain s...
Ligand InfoPC cidPC sid
In DepthDetails ArticlePubMed
TargetG protein-coupled receptor 34a(Danio rerio)
The University Of Tokyo
Curated by ChEMBL
LigandPNGBDBM50560840(CHEMBL4753103)
Affinity DataEC50:  513nM. Assay description: Agonist activity at zebrafish GPR34 type a expressed in HEK293 cells co-transfected with AP-TGFalpha/Galphaq/i1 assessed as induction of ectodomain s...
Ligand InfoPC cidPC sid
In DepthDetails ArticlePubMed
TargetG protein-coupled receptor 34b(Danio rerio)
The University Of Tokyo
Curated by ChEMBL
LigandPNGBDBM50560840(CHEMBL4753103)
Affinity DataEC50:  12nM. Assay description: Agonist activity at zebrafish GPR34 type b expressed in HEK293 cells co-transfected with AP-TGFalpha/Galphaq/i1 assessed as induction of ectodomain s...
Ligand InfoPC cidPC sid
In DepthDetails ArticlePubMed
TargetProbable G-protein coupled receptor 34(Homo sapiens (Human))
The University Of Tokyo
Curated by ChEMBL
LigandPNGBDBM50560840(CHEMBL4753103)
Affinity DataEC50:  0.75nM. Assay description: Agonist activity at human GPR34 expressed in HEK293 cells co-transfected with AP-TGFalpha/Galphaq/i1 assessed as induction of ectodomain shedding of ...
Ligand InfoPC cidPC sid
In DepthDetails ArticlePubMed