BDBM50561925 CHEMBL4743241::US11236069, Example 11-4
SMILES Cc1cc(NC(=O)c2ccc(NS(=O)(=O)CCO)cc2N2CCC3(CC3)CC2)nc(OC2CCC2)n1
InChI Key InChIKey=RTLWPYOCDKCRCM-UHFFFAOYSA-N
Data  2 IC50
  Tab Delimited (TSV)   2D SDfile   Computed 3D by Vconf -m prep SDfile
Find this compound or compounds like it in BindingDB:
Activity Spreadsheet -- Enzyme Inhibition Constant Data from BindingDB
Found 2 hits for monomerid = 50561925
TargetKinesin-like protein KIF18A [1-467](Homo sapiens (Human))
Amgen
US Patent
LigandPNGBDBM50561925(CHEMBL4743241 | US11236069, Example 11-4)
Affinity DataIC50:  18nM. Assay description: Microtubule-stimulated ATPase activity assay is used to measure KIF18A enzyme activity after treatment with compound. Compounds were 2-fold serially ...
Ligand InfoPC cidPC sid
In DepthDetails US Patent
TargetKinesin-like protein KIF18A(Homo sapiens)
Smith, Gambrell & Russell
Curated by ChEMBL
LigandPNGBDBM50561925(CHEMBL4743241 | US11236069, Example 11-4)
Affinity DataIC50:  18nM. Assay description: Inhibition of recombinant human His-tagged KIF18A (1 to 467 residues) expressed in baculovirus expression system assessed as inhibition of microtubul...
Ligand InfoPC cidPC sid
In DepthDetails ArticlePubMed