BDBM505972 (S)-6-(((1-([1,1'-bi(cyclopropan)]- 1-yl)-1H-1,2,3- triazol-4-yl)(6-fluoro-2-methylpyridin-3- yl)methyl)amino)-4- (neopentylamino)quinoline- 3,8-dicarbonitrile::US11066414, Compound 621
SMILES Cc1nc(F)ccc1[C@H](Nc1cc(C#N)c2ncc(C#N)c(NCC(C)(C)C)c2c1)C1=CN(NN1)C1(CC1)C1CC1
InChI Key InChIKey=CASDPHSANHPREK-LJAQVGFWSA-N
Data  1 IC50
  Tab Delimited (TSV)   2D SDfile   Computed 3D by Vconf -m prep SDfile
Find this compound or compounds like it in BindingDB:
Activity Spreadsheet -- Enzyme Inhibition Constant Data from BindingDB
Found 1 hit for monomerid = 505972
TargetEpidermal growth factor receptor(Homo sapiens (Human))
Gilead Sciences
US Patent
LigandPNGBDBM505972((S)-6-(((1-([1,1'-bi(cyclopropan)]- 1-yl)-1H-1,2,3...)
Affinity DataIC50:  1nM. Assay description: EGFR activity was measured using KinEASE (Cisbio), a time-resolved fluorescence resonance energy transfer (TR-FRET) immunoassay. In this assay, EGFR-...
Ligand InfoPC cidPC sid
In DepthDetails US Patent