BDBM506350 US11045448, Cpd. No. 59::methyl ((1S,2R)-2-((S)-cyano(3-fluorophenyl)(1-((1-(4-((1- ((E)-4-morpholinobut-2-enoyl)azetidin-3- yl)sulfonyl)phenyl)azetidin-3-yl)methyl)piperidin-4- yl)methyl)cyclopentyl)carbamate
SMILES COC(=O)N[C@H]1CCC[C@@H]1[C@@](C#N)(C1CCN(CC2CN(C2)c2ccc(cc2)S(=O)(=O)C2CN(C2)C(=O)\C=C\CN2CCOCC2)CC1)c1cccc(F)c1
InChI Key InChIKey=GTMXROGUPBVOPW-GPNHBTBYSA-N
Data  1 IC50
  Tab Delimited (TSV)   2D SDfile   Computed 3D by Vconf -m prep SDfile
Find this compound or compounds like it in BindingDB:
Activity Spreadsheet -- Enzyme Inhibition Constant Data from BindingDB
Found 1 hit for monomerid = 506350
TargetMenin(Homo sapiens (Human))
The Regents Of The University Of Michigan
US Patent
LigandPNGBDBM506350(US11045448, Cpd. No. 59 | methyl ((1S,2R)-2-((S)-c...)
Affinity DataIC50:  4nM. Assay description: A fluorescence polarization (FP) competitive binding assay was used to determine the binding affinities of representative menin inhibitors. A FAM lab...
Ligand InfoPC cidPC sid
In DepthDetails US Patent